"ID","PONDERACION","REGION","COD_PROVINCIA","COD_TAMANIO_AGLOMERADO","AGLOMERADO","BHCV01","BHCV02","BHCV03","BHCV04","BHCV05","BHCV06","BHCV07","BHCV08","BHCV09","BHCV10","BHCV11","BHHO01","BHHO02","BHHO03","CANT_COMPONENTES","BHCH13","TIPO_HOGAR","BHIH01_01","RANGO_INGRESO","IMPUTADO","ITF_UC_QUINTILES","BHCH04_J","BHCH05_J","RANGO_EDAD_J","BHCH07_J","NIVEL_INSTRUCCION_J","NIVEL_INSTRUCCION_AGRUPADO_J","BHCH12_01_J","BHCH12_02_J","BHCH12_03_J","BHCH12_04_J","BHCH12_05_J","BHCH12_06_J","BHCH12_09_J","COBERTURA_SALUD_J","CONDICION_ACTIVIDAD_J","BHCH03","BHCH04","BHCH05","RANGO_EDAD","BHCH07","NIVEL_INSTRUCCION","NIVEL_INSTRUCCION_AGRUPADO","BHCH12_01","BHCH12_02","BHCH12_03","BHCH12_04","BHCH12_05","BHCH12_06","BHCH12_09","COBERTURA_SALUD","CONDICION_ACTIVIDAD","BISG01","BISG02","BISG03","BISG04","BISG05","BISG06","BIAF01","BIAF02","BIAF03","BIAF04","BIAF05","BIAF06","BIAF07","BIAF08","BIAF09","BIAF10_01","BIAF10_02","BIAF10_03","BIAF10_04","NIVEL_ACTIVIDAD_FISICA","BIAM01_01","BIAM01_02","BIAM01_03","BIAM01_04","BIAM02","BIAM03","BIAM04","BITA01","BITA02","BITA03","BITA04","BITA05","BITA06","BITA07","BITA08","BITA09_01","BITA09_02","BITA09_03","BITA10","BITA11","BITA12","BITA13","BITA14_01","BITA14_02","BITA14_03","BITA14_04","BITA14_05","BITA14_06","BITA15","BITA16","BITA17","CONSUMO_TABACO_100","PREVALENCIA_CONSUMO_TABACO","PRV_P_TA_14A","IMAGENES_TABACO","BIHA01","BIHA02","BIHA03","BIHA04","BIHA05_01","BIHA05_02","BIHA06","BIHA07","BIHA08","BIHA09","CONTROL_HIPERTENSION","PREVALENCIA_HIPERTENSION","BIPC01","BIPC02","BIPC03","BIPC04","BIPC05","BIPC06","IMC_AGRUPADO","BIAL01","BIAL02","BIAL03","BIAL04","BIAL05","BIAL06","BIAL07","FRUYVER","PROMEDIO_FV_DIARIO","BICO01","BICO02","BICO03","BICO04","BICO05_01","BICO05_02","CONTROL_COLESTEROL","PREVALENCIA_COLESTEROL","BICA01","BICA02","BICA03","BICA04_01","BICA04_02","BICA04_03","BICA04_04","BICA05_01","BICA05_02","BICA05_03","BICA05_04","BICA06","C_REG","C_EPI","BIDI01","BIDI02","BIDI03","BIDI04_01","BIDI04_02","BIDI05","BIDI06","BIDI07","BIDI08","BIDI09","BIDI10","BIDI11","BIDI12","CONTROL_DIABETES","PREVALENCIA_DIABETES","BILE01","BILE02","BILE03","BIPP01","BIPP02","BIPP03","BIPP04","C_MAM","C_PAP","BIAC01_01","BIAC01_02","BIAC01_03","BIAC01_04","BIVA01_01","BIVA01_02","BIVA01_03","BIVA01_04","BIVA01_05","BIVA02","BIVA03","BICC01_01","BICC01_02","BICC01_03","BICC02","BICC03","C_COLON"
1422588271,41,2,42,4,9,1,1,1,4,2,1,1,1,1,1,1,1,1,1,1,1,1,700,1,0,1,2,54,5,5,3,2,,,,,,1,,2,1,1,2,54,4,5,3,2,,,,,,1,,2,1,4,1,1,2,2,1,8,,8,,8,,600,1,,,,,,3,1,2,2,2,,,,1,20,1,1,,,5,,,,,2,2,,2,1,1,9,9,2,2,1,1,2,1,1,,2,1,1,3,,,,,,,,1,2,2,,2,1,58,152,2,1,2,2,0,,0,,2,"0",2,,2,,,,2,,2,,"","","","",,"","","",,,2,2,2,,,,,4,,,,,,,,2,2,4,4,4,1,4,1,4,2,2,2,2,2,2,2,2,2,2,2,2,2,2,2,2,,,2
252527449,407,4,54,4,9,1,4,1,4,1,2,1,1,1,1,3,1,4,3,4,2,4,6000,10,0,3,1,39,4,1,5,3,1,,,,,,,1,1,2,2,35,3,1,4,2,1,,,,,,,1,1,2,1,1,1,1,1,8,,8,,7,840,330,,1,2,2,2,1,2,2,2,2,2,2,,,2,,,,,,,,,,,,,,2,2,2,2,2,2,2,2,7,,3,2,2,,2,,3,,,,,,,,2,,2,,1,1,69,166,2,1,3,1,3,1,1,1,2,"0,5714285714285714285714285714285714285714",2,,2,,,,2,,2,,"","","","",,"","","",,,2,2,2,,,,,3,,,,,,,,1,2,4,4,1,2,,2,,2,2,2,2,2,2,1,1,2,2,1,2,2,,,,,,
1776737420,229,2,42,4,9,1,3,1,3,1,1,1,1,1,1,1,1,3,1,2,2,2,10000,12,0,5,2,60,5,2,3,2,1,,,,,,,1,1,2,1,65,5,2,5,3,1,,,,,,,1,3,3,1,1,1,1,1,7,210,8,,8,,240,,1,2,2,2,1,1,1,2,2,2,,,,1,18,1,3,,,,1,20,,,,,,2,2,9,9,2,2,9,2,2,,2,1,2,,1,1,2,1,1,2,1,1,1,1,1,1,2,,2,1,101,195,2,2,1,2,5,1,5,1,2,"1,42857142857142857142857142857142857143",2,,2,,,,2,,1,1,"21,4","888","2","888",2,"888","888","888",2,2,2,2,2,,,,,3,,,,,,,,1,2,3,4,1,,,,,,,2,2,1,2,1,1,1,1,1,2,2,2,2,2,,,2
4162891238,270,4,54,4,9,1,1,1,4,1,3,2,1,1,3,4,1,1,1,2,2,2,2900,5,0,2,1,23,2,1,2,1,,,,,,1,,2,1,2,2,27,2,1,5,3,1,,,,,,,1,3,3,1,1,1,1,1,8,,8,,6,360,240,,2,1,2,1,1,2,2,2,2,2,2,,,2,,,,,,,,,,,,,,1,2,9,9,9,9,9,1,1,,3,2,2,,1,1,3,,,,,,,,1,2,1,1,,1,96,160,3,1,3,2,3,1,7,1,2,"1,42857142857142857142857142857142857143",2,,2,,,,2,,1,1,"4,28","1","888","888",2,"888","888","888",2,3,2,2,2,,,,,4,,,,,,,,2,2,4,4,4,2,,2,,2,2,2,2,2,2,2,2,2,2,2,2,2,,,,,,
2994162338,101,2,42,4,9,1,2,2,4,2,1,1,1,1,1,1,1,2,1,2,2,2,2000,3,2,1,1,63,5,2,2,1,,,,,,1,,2,1,1,1,63,4,2,2,1,,,,,,1,,2,1,5,2,1,2,2,1,8,,8,,8,,480,5,,,,,,3,1,2,2,2,,,,1,18,1,3,,,,1,8,,,,,,2,2,2,2,2,2,2,2,2,,2,1,2,,1,1,2,1,1,2,2,,,,1,1,2,,2,1,104,165,3,2,3,2,3,1,3,1,2,"0,8571428571428571428571428571428571428571",1,1,1,2,,,1,1,1,1,"4,28","888","1","888",2,"888","888","888",2,2,2,2,2,,,,,1,,,,,,,,1,2,4,4,3,,,,,,,1,2,2,2,1,1,1,1,1,2,2,2,2,2,,,2
3017827095,132,2,42,4,9,1,2,1,4,1,1,1,1,1,1,1,1,2,2,4,4,4,9500,12,2,4,1,40,4,1,3,2,1,,,,,,,1,1,1,1,40,3,1,3,2,1,,,,,,,1,1,2,1,1,1,1,1,8,,8,,8,,120,1,,,,,,3,2,2,2,2,2,,,1,20,1,1,,,20,,,,,2,1,99,1,2,2,2,2,2,2,1,1,1,1,1,,1,2,,3,,,,,,,,2,,2,,2,2,75,175,1,1,2,2,2,1,2,1,2,"0,5714285714285714285714285714285714285714",2,,2,,,,2,,1,2,"","","","",,"","","",,,2,2,2,,,,,4,,,,,,,,2,2,3,1,4,,,,,,,2,2,2,2,1,2,1,2,1,2,2,,,,,,
2650052100,628,3,66,2,8,1,4,1,2,1,1,1,1,1,1,1,1,4,2,3,3,3,6000,10,0,3,1,61,5,2,4,2,1,,,,,,,1,1,2,2,49,3,2,3,2,1,,,,,,,1,3,3,1,1,1,1,1,3,180,2,120,3,180,180,,1,2,2,1,1,2,2,2,2,2,2,,,2,,,,,,,,,,,,,,1,1,9,9,2,9,2,2,2,,3,2,1,,1,1,2,2,,,1,5,1,1,1,1,1,1,,1,62,157,2,2,3,2,4,2,7,3,2,"4,14285714285714285714285714285714285714",1,1,2,,,,1,2,1,1,"2","3","1","888",2,"6","888","888",2,3,2,1,2,,,,,1,,,,,,,,1,2,4,4,4,1,1,1,1,1,1,2,2,2,2,1,1,1,1,1,1,1,,,,,,
1153057755,174,5,74,4,9,1,5,1,1,1,1,1,1,1,1,1,1,5,3,4,4,4,12000,13,1,5,1,70,6,2,3,2,1,,,,,,,1,1,3,1,40,3,6,5,3,1,,,,,,,1,1,1,1,1,1,1,1,7,420,5,2400,2,120,180,,2,2,1,1,1,1,2,2,2,2,2,,,1,15,2,3,,,,2,15,,,,,,1,2,1,9,1,2,1,1,1,,3,1,1,,1,1,3,,,,,,,,1,2,2,,2,1,70,163,2,1,2,2,7,2,7,1,2,"3",2,,2,,,,2,,1,1,"29,96","888","2","888",2,"888","888","888",2,2,2,2,2,,,,,4,,,,,,,,2,2,3,3,1,,,,,,,2,2,2,2,1,1,2,1,2,1,1,,,,,,
4192956833,107,2,42,4,9,1,2,1,2,2,1,1,1,1,1,1,1,2,2,4,2,4,3400,6,1,1,2,23,2,2,3,2,,,,,,1,,2,1,1,2,23,1,2,3,2,,,,,,1,,2,1,1,1,1,1,1,1,8,,8,,5,150,120,,1,2,2,1,1,2,2,2,2,2,2,,,2,,,,,,,,,,,,,,2,2,2,2,9,9,1,2,2,,3,2,1,,2,,3,,,,,,,,2,,2,,2,1,70,160,2,1,2,2,3,3,3,1,2,"1,71428571428571428571428571428571428571",2,,2,,,,2,,1,1,"12,84","1","888","888",2,"888","888","888",2,2,2,2,2,,,,,3,,,,,,,,1,2,4,1,4,1,2,2,,1,2,2,2,2,2,1,1,1,1,1,2,2,,,,,,
1228146431,569,2,30,4,9,1,2,1,4,1,1,1,1,1,1,1,1,2,1,2,2,2,10000,12,1,5,1,59,5,2,3,2,,1,,,,,,1,1,2,2,55,4,2,3,2,,1,,,,,,1,3,1,1,1,1,1,1,8,,8,,3,180,240,,1,2,2,2,1,3,2,2,2,2,2,,,1,23,1,1,,,2,,,,,2,2,,2,2,2,9,9,2,1,1,1,1,1,1,,1,1,1,3,,,,,,,,1,2,2,,2,1,67,165,1,1,3,1,7,1,7,1,2,"2",2,,2,,,,2,,2,,"","","","",,"","","",,,2,2,2,,,,,4,,,,,,,,2,2,4,4,1,2,,2,,2,2,2,2,2,2,2,2,2,2,2,1,2,2,2,2,,,2
2530605878,109,6,62,4,9,1,4,1,4,1,1,1,1,1,1,1,1,4,3,4,3,4,3500,6,0,1,1,44,4,2,2,1,1,,,,,,,1,3,3,1,19,1,6,4,2,1,,,,,,,1,1,4,1,1,1,1,1,1,60,8,,7,540,30,,6,1,2,1,1,2,2,2,2,2,2,,,1,18,1,2,2,2,,,,,,2,1,99,1,1,2,9,9,9,9,2,1,1,1,1,,1,1,1,3,,,,,,,,1,2,2,,2,1,69,170,1,1,1,2,7,2,4,1,2,"2,57142857142857142857142857142857142857",2,,2,,,,2,,1,1,"8,56","3","888","1",2,"888","888","888",2,2,2,2,2,,,,,4,,,,,,,,2,2,4,2,4,,,,,,,2,2,2,2,1,1,1,1,1,1,1,,,,,,
2754060881,260,3,46,3,9,1,3,1,1,1,2,1,1,1,1,1,1,3,2,2,2,6,15000,14,0,5,2,70,6,5,5,3,1,,,1,,,,1,3,1,2,70,5,5,5,3,1,,,1,,,,1,3,3,1,1,1,1,1,8,,8,,8,,600,9,,,,,,3,1,2,2,1,,,,2,,,,,,,,,,,,,,2,2,9,9,9,2,1,2,2,,3,2,1,,1,1,2,1,1,1,1,5,1,1,1,1,1,2,2,1,70,168,1,1,1,2,3,2,3,2,2,"1,71428571428571428571428571428571428571",1,1,1,1,1,2,1,1,2,,"","","","",,"","","",,,2,2,1,2,1,1,2,1,1,1,1,1,1,1,2,1,1,4,4,4,1,2,1,2,1,1,2,2,2,2,2,1,2,2,2,1,1,1,1,1,2,2,1
460370764,311,4,34,4,9,1,2,1,4,1,2,1,1,1,1,2,1,2,1,5,3,4,700,1,1,1,2,44,4,2,4,2,,,,,,1,,2,1,3,1,20,1,6,4,2,,,,,,1,,2,3,1,1,1,1,1,1,3,120,8,,7,180,180,,9,2,2,2,1,2,2,2,2,2,2,,,1,12,1,1,,,99,,,,,2,2,,2,2,2,9,2,9,1,2,1,1,1,1,,1,2,,3,,,,,,,,2,,2,,2,2,70,169,1,2,2,2,2,6,7,1,2,"2,71428571428571428571428571428571428571",2,,2,,,,2,,1,1,"8,56","888","6","888",2,"888","18","888",2,2,2,1,2,,,,,2,,,,,,,,1,2,4,4,4,,,,,,,2,2,2,2,1,2,2,2,2,2,2,,,,,,
1634569512,228,2,42,3,9,1,4,1,1,2,1,1,1,1,1,1,1,4,2,3,3,4,7000,11,0,4,1,67,6,2,3,2,1,,,,,,,1,3,3,2,30,2,6,6,3,,,,,,1,,2,1,2,1,1,1,1,1,2,120,8,,1,60,180,,2,2,2,2,1,3,2,2,2,2,2,,,2,,,,,,,,,,,,,,1,2,2,1,2,9,9,2,2,,3,2,1,,1,1,3,,,,,,,,1,2,2,,2,1,54,155,1,1,1,2,3,1,2,1,2,"0,7142857142857142857142857142857142857143",1,1,2,,,,1,2,1,1,"2","2","888","2",2,"2","888","2",2,2,2,2,2,,,,,1,,,,,,,,1,2,4,1,1,2,,1,1,2,1,2,2,2,2,1,2,2,1,1,1,1,,,,,,
2147947784,502,2,14,2,2,3,1,1,2,2,2,1,1,1,1,1,1,1,1,1,1,1,2500,4,1,2,1,57,5,4,4,2,,,1,,,,,1,1,1,1,57,4,4,4,2,,,1,,,,,1,1,4,1,1,2,3,2,8,,3,300,4,55,240,,6,2,1,1,2,2,2,1,2,1,,,,1,17,1,1,,,30,,,,,2,2,,2,1,2,2,1,9,1,1,1,1,1,1,,1,1,1,2,1,1,2,1,1,1,1,1,1,2,,2,1,70,170,1,1,2,2,1,1,2,1,2,"0,4285714285714285714285714285714285714286",1,1,2,,,,1,2,1,1,"29,96","888","4,5","1",2,"888","888","12",2,2,1,1,2,,,,,2,,,,,,,,1,2,4,2,2,,,,,,,2,2,2,1,1,2,2,2,2,1,2,2,2,2,,,2
2755144104,79,6,62,4,9,1,2,1,4,1,1,1,1,1,1,1,1,2,2,3,2,4,8000,11,0,4,1,32,3,1,6,3,1,,,,,,,1,1,1,1,32,2,1,6,3,1,,,,,,,1,1,3,1,1,1,1,1,8,,8,,1,60,9999,,2,1,2,2,2,3,2,1,2,2,,,,1,30,1,3,,,,2,2,,,,,,2,2,2,2,2,2,2,1,1,,2,1,2,,1,1,3,,,,,,,,1,2,2,,2,9,92,180,2,1,1,2,3,1,3,1,2,"0,8571428571428571428571428571428571428571",1,1,2,,,,1,2,1,1,"4,28","3","888","888",2,"888","888","888",2,2,2,2,2,,,,,3,,,,,,,,1,2,4,4,2,,,,,,,2,2,2,2,9,9,9,9,9,9,9,,,,,,
1831521181,1122,5,50,2,4,1,4,1,1,1,1,1,1,1,1,1,1,4,3,3,3,6,7000,11,1,4,1,45,4,3,6,3,1,,,,,,,1,1,3,2,18,1,6,4,2,1,,,,,,,1,3,2,1,1,1,1,1,8,,3,180,5,100,480,,9,1,2,1,2,2,2,2,2,2,1,2,3,1,14,2,3,,,,2,2,,,,,,1,2,9,2,1,9,9,1,1,,3,1,1,,1,2,3,,,,,,,,1,2,2,,2,1,54,165,1,1,3,2,4,1,3,1,2,"1",2,,2,,,,2,,1,1,"2","1","888","1",2,"888","888","888",2,2,2,2,2,,,,,3,,,,,,,,1,2,4,1,1,2,,2,,2,2,2,2,2,2,2,2,2,2,2,1,1,,,,,,
2696739389,451,6,62,3,9,1,5,1,4,1,1,1,1,1,1,2,1,5,3,4,2,4,8000,11,0,4,2,42,4,1,4,2,1,,,,,,,1,1,2,1,47,3,1,5,3,1,,,,,,,1,1,3,1,1,1,2,1,8,,1,60,8,,180,,2,1,1,2,1,3,2,2,1,2,,,,1,17,2,3,,,,9,25,,,,,,2,2,2,2,2,2,2,7,1,,3,1,2,,1,1,2,1,1,2,2,,,,1,1,1,2,1,1,96,169,3,1,3,2,3,2,5,1,2,"1,57142857142857142857142857142857142857",1,2,2,,,,1,2,1,1,"4","6","888","888",2,"9","888","888",2,2,2,1,2,,,,,2,,,,,,,,1,2,4,4,3,,,,,,,2,2,2,2,1,1,2,1,1,1,2,,,,,,
1592928223,370,3,46,3,9,1,2,2,2,1,2,1,1,1,1,1,1,2,2,4,3,5,6000,10,1,3,1,29,3,1,4,2,,,,,,1,,2,1,1,1,29,2,1,4,2,,,,,,1,,2,1,4,1,1,1,1,2,1,240,8,,4,180,180,,2,2,2,1,1,2,1,2,2,2,,,,1,18,1,3,,,,1,2,,,,,,1,1,1,2,2,2,2,2,1,,2,1,1,,1,1,3,,,,,,,,1,2,2,,1,1,110,175,3,2,3,2,2,1,2,1,2,"0,5714285714285714285714285714285714285714",1,2,2,,,,1,2,1,2,"","","","",,"","","",,,2,2,2,,,,,4,,,,,,,,2,2,4,2,2,,,,,,,2,2,2,2,1,1,2,2,2,2,2,,,,,,
3727709501,138,2,42,3,9,1,3,1,2,2,1,1,1,1,1,1,1,3,1,2,2,2,5000,9,0,3,2,74,6,1,2,1,1,,,,,,,1,3,2,1,76,5,1,3,2,1,,,,,,,1,3,4,1,1,1,2,1,8,,8,,8,,360,5,,,,,,3,1,2,2,2,,,,2,,,,,,,,,,,,,,2,2,9,9,9,2,9,2,2,,3,2,2,,1,1,3,,,,,,,,1,2,2,,2,1,61,158,1,2,2,2,0,,2,1,2,"0,2857142857142857142857142857142857142857",1,1,2,,,,1,2,2,,"","","","",,"","","",,,2,2,2,,,,,1,,,,,,,,1,2,4,4,2,,,,,,,2,2,2,2,1,1,1,1,1,2,2,2,2,2,,,2
3669643518,555,3,66,2,8,1,4,1,2,1,1,1,1,1,1,1,1,4,3,4,3,4,2000,3,2,1,1,49,4,2,5,3,1,,,,,,,1,1,3,1,18,1,6,6,3,1,,,,,,,1,3,3,1,1,1,1,1,4,480,2,90,7,210,300,,2,2,2,1,1,1,1,1,2,2,,,,2,,,,,,,,,,,,,,1,1,9,1,1,9,9,1,1,,3,2,1,,1,1,3,,,,,,,,1,2,1,1,,1,74,170,2,2,3,2,4,2,4,2,2,"2,28571428571428571428571428571428571429",2,,2,,,,2,,1,2,"","","","",,"","","",,,2,2,2,,,,,9,,,,,,,,9,2,4,1,1,,,,,,,2,2,2,2,1,1,1,1,1,1,2,,,,,,
786927171,253,2,82,4,9,1,1,2,4,1,2,1,1,1,1,2,1,1,1,1,1,1,1000,1,0,1,2,39,4,6,3,2,,,,,,1,,2,1,1,2,39,3,6,3,2,,,,,,1,,2,1,2,1,1,1,1,1,8,,8,,7,840,180,,1,1,1,1,2,2,2,2,2,2,2,,,2,,,,,,,,,,,,,,2,2,2,9,9,9,2,1,1,,3,2,2,,2,,1,2,,,2,,,,2,,2,,1,1,69,165,2,1,3,2,0,,6,1,2,"0,8571428571428571428571428571428571428571",2,,2,,,,2,,2,,"","","","",,"","","",,,2,2,2,,,,,4,,,,,,,,2,2,3,1,1,2,,2,,2,2,2,2,2,2,2,2,2,2,2,1,2,,,,,,
357814027,171,6,62,3,9,1,3,1,4,1,1,1,1,1,1,1,1,3,1,2,2,2,9000,12,1,5,1,38,4,1,4,2,1,,,,,,,1,1,2,2,33,2,1,4,2,1,,,,,,,1,1,3,1,1,1,1,1,8,,8,,6,360,9999,,11,2,1,1,2,2,1,1,2,1,,,,1,99,1,3,,,,1,2,,,,,,2,2,2,2,2,2,2,7,2,,2,1,2,,1,1,3,,,,,,,,1,2,1,1,,1,87,166,3,1,3,1,7,3,7,2,1,"5",1,1,1,2,,,1,1,1,2,"","","","",,"","","",,,2,2,2,,,,,1,,,,,,,,1,2,4,4,2,2,,1,1,2,1,2,2,2,2,1,1,1,2,9,1,1,,,,,,
1746460461,503,4,54,4,9,1,4,1,4,1,2,1,1,1,1,2,1,4,3,3,3,8,6000,10,1,3,2,23,2,5,6,3,,,,,,1,,2,3,4,1,54,4,4,5,3,,,,,,1,,2,1,3,1,1,1,1,1,3,180,8,,2,30,300,,2,2,1,1,1,2,2,2,2,2,2,,,1,18,1,1,,,20,,,,,1,1,2,1,1,1,2,1,2,9,1,1,1,1,1,,1,1,1,3,,,,,,,,1,2,2,,2,1,85,178,2,2,3,2,0,,3,1,2,"0,4285714285714285714285714285714285714286",2,,2,,,,2,,1,1,"29,96","888","2","888",2,"6","4,5","888",2,2,2,1,2,,,,,4,,,,,,,,2,2,4,1,1,,,,,,,2,2,2,2,2,2,2,2,2,1,2,2,2,2,,,2
499103713,1678,2,30,4,9,1,3,1,4,1,1,1,1,1,1,1,1,3,2,5,5,4,15000,14,0,5,2,52,5,2,5,3,1,,,1,,,,1,1,1,2,52,4,2,5,3,1,,,1,,,,1,1,3,2,3,2,3,1,8,,8,,8,,480,5,,,,,,3,1,2,2,1,,,,2,,,,,,,,,,,,,,2,2,2,2,2,2,2,2,1,,3,2,2,,1,1,2,1,1,1,1,2,1,1,1,1,1,1,,1,88,175,2,1,3,2,6,1,6,2,2,"2,57142857142857142857142857142857142857",1,1,2,,,,1,2,1,1,"1","888","888","888",2,"0,5","888","888",2,2,2,2,2,,,,,1,,,,,,,,1,2,4,4,2,1,1,1,1,1,1,2,2,2,2,1,2,9,2,2,1,1,2,2,2,,,2
3741527827,754,5,74,3,9,1,3,1,1,1,1,1,1,1,1,1,1,3,3,8,4,5,7000,11,0,2,1,36,4,1,3,2,,1,,,,,,1,1,2,2,34,2,1,5,3,,1,,,,,,1,3,2,1,1,1,1,1,8,,8,,8,,360,9,,,,,,3,2,2,2,2,2,,,2,,,,,,,,,,,,,,1,1,9,9,9,9,9,1,2,,3,2,1,,1,1,3,,,,,,,,1,2,1,1,,1,69,160,2,2,3,2,7,2,6,2,2,"3,71428571428571428571428571428571428571",2,,2,,,,2,,1,3,"","","","",,"","","",,,2,2,2,,,,,2,,,,,,,,1,2,4,4,2,2,,1,1,2,1,2,2,2,2,1,1,2,2,2,1,2,,,,,,
3376202651,117,3,86,3,9,1,3,1,1,2,2,1,1,1,1,2,1,3,2,2,1,6,3000,5,0,2,2,52,5,4,5,3,1,,,,,,,1,1,1,2,52,4,4,5,3,1,,,,,,,1,1,4,1,1,1,2,2,8,,8,,8,,540,7,,,,,,3,2,2,2,2,2,,,1,35,1,2,30,4,,,,,,2,1,1,1,2,1,9,2,2,1,2,1,1,1,1,,1,1,1,2,1,1,2,1,1,1,1,1,1,1,2,1,1,70,155,2,2,3,2,0,,6,1,2,"0,8571428571428571428571428571428571428571",1,1,1,1,1,2,1,1,1,3,"","","","",,"","","",,,2,2,2,,,,,1,,,,,,,,1,2,4,2,4,1,2,1,1,1,1,2,2,2,2,1,2,2,2,2,1,2,2,2,2,,,2
3212263949,739,4,54,4,9,1,4,1,4,1,2,1,1,1,1,2,1,4,3,8,2,4,4400,8,0,1,1,50,5,2,3,2,,,,,,1,,2,1,2,2,36,3,2,3,2,,,,,,1,,2,3,4,1,1,1,1,1,8,,8,,5,50,120,,2,2,2,1,2,3,2,2,2,2,2,,,2,,,,,,,,,,,,,,2,2,9,2,2,2,2,2,1,,3,2,2,,1,3,3,,,,,,,,2,2,2,,2,3,65,155,2,1,3,2,2,1,7,2,2,"2,28571428571428571428571428571428571429",1,3,2,,,,1,2,2,,"","","","",,"","","",,,2,2,2,,,,,3,,,,,,,,1,2,4,4,1,2,,1,3,2,2,2,2,2,1,1,1,2,1,2,1,2,,,,,,
36032219,541,2,82,3,9,1,4,2,4,2,2,1,1,1,1,1,1,4,2,2,2,6,4700,9,0,3,1,90,6,5,2,1,1,,,,,,,1,1,3,1,56,4,4,3,2,,,,,,1,,2,1,2,1,1,1,1,1,8,,8,,7,120,180,,9,1,1,1,2,3,2,2,2,2,2,,,1,18,1,1,,,3,,,,,2,2,,1,1,2,9,1,2,1,1,1,2,1,1,,2,1,1,3,,,,,,,,1,2,2,,2,1,70,174,1,1,2,2,2,5,4,1,2,"2",2,,2,,,,2,,1,1,"8,56","3","888","888",2,"888","3","888",2,2,2,2,2,,,,,1,,,,,,,,1,2,4,4,2,,,,,,,2,2,2,2,2,2,2,2,2,1,2,9,9,9,,,9
4201766342,41,6,94,4,9,1,4,1,6,1,1,1,1,1,1,1,1,4,2,2,1,6,30000,17,0,5,1,47,4,6,7,3,1,,1,,,,,1,1,1,1,47,3,6,7,3,1,,1,,,,,1,1,3,1,1,1,1,1,8,,8,,7,70,240,,1,2,1,2,2,3,2,2,2,2,2,,,1,18,1,1,,,2,,,,,2,1,12,2,2,2,2,9,2,2,2,1,1,1,1,,1,1,1,1,2,,,2,,,,1,1,2,,1,1,76,160,2,1,3,1,7,1,4,1,2,"1,57142857142857142857142857142857142857",1,2,1,2,,,1,1,1,2,"","","","",,"","","",,,2,2,2,,,,,2,,,,,,,,1,2,4,4,1,,,,,,,2,2,2,2,1,2,2,2,2,1,1,,,,,,
1330234243,125,6,62,4,9,1,3,1,6,1,1,1,1,1,1,1,1,3,2,4,3,5,4000,7,0,2,1,50,5,1,2,1,,,,,,1,,2,1,2,2,57,4,1,1,1,,,,,,1,,2,1,5,2,2,2,3,2,8,,8,,2,120,120,,9,1,2,2,1,3,1,2,2,2,,,,2,,,,,,,,,,,,,,2,2,2,2,2,2,2,1,1,,3,2,2,,1,1,2,1,1,1,1,5,1,1,1,1,1,1,,1,999,999,9,1,3,1,2,1,0,,2,"0,2857142857142857142857142857142857142857",1,1,1,1,1,1,1,1,2,,"","","","",,"","","",,,2,2,2,,,,,1,,,,,,,,1,2,4,1,4,1,4,1,1,2,1,1,1,2,2,1,2,2,2,1,1,2,2,2,2,,,2
950092636,76,2,6,3,9,1,1,1,4,2,1,1,1,1,1,1,1,1,1,1,1,1,3500,6,0,3,2,52,5,3,2,1,,,,,,1,,2,1,1,2,52,4,3,2,1,,,,,,1,,2,1,4,1,1,1,1,1,8,,8,,7,600,360,,9,1,2,1,2,2,2,2,2,2,2,,,1,15,1,3,,,,1,16,,,,,,2,2,2,2,2,2,2,1,1,,2,1,2,,1,1,2,2,,,2,,,,1,1,1,2,2,1,78,999,9,1,2,1,0,,0,,2,"0",2,,2,,,,2,,2,,"","","","",,"","","",,,2,2,2,,,,,9,,,,,,,,9,2,4,4,2,1,4,1,4,2,2,2,2,2,2,2,1,2,9,2,1,1,2,2,2,,,2
3391485843,814,6,62,4,9,1,3,1,1,1,1,1,1,1,1,1,1,3,2,4,3,3,6500,11,0,3,1,63,5,1,3,2,1,,,,,,,1,1,2,2,60,4,1,5,3,1,,,,,,,1,3,3,1,1,1,1,1,8,,8,,7,420,300,,9,2,2,1,2,2,2,2,2,2,2,,,1,15,2,3,,,,2,10,,,,,,2,2,2,2,2,2,2,2,2,,3,1,2,,1,2,3,,,,,,,,1,2,2,,2,1,999,150,9,1,3,2,3,1,2,1,2,"0,7142857142857142857142857142857142857143",2,,2,,,,2,,1,1,"2","888","888","3",2,"888","888","888",2,2,2,2,2,,,,,3,,,,,,,,1,2,4,4,4,2,,2,,2,2,2,2,2,2,1,1,2,2,2,1,2,2,2,2,,,2
1829722798,136,3,38,4,9,1,3,1,4,1,1,1,1,1,1,1,1,3,3,2,2,6,4000,7,1,3,2,62,5,4,3,2,1,,,,,,,1,3,1,2,62,4,4,3,2,1,,,,,,,1,3,4,1,1,1,1,1,8,,8,,8,,180,5,,,,,,3,1,2,2,2,,,,2,,,,,,,,,,,,,,2,2,9,9,2,2,2,1,1,,3,2,2,,1,1,1,1,1,2,1,5,1,1,1,1,2,,1,1,74,158,2,2,3,2,7,2,7,1,2,"3",1,1,1,1,1,2,1,1,1,1,"1","888","888","888",2,"888","1","888",2,2,2,2,2,,,,,1,,,,,,,,1,2,4,4,1,1,4,1,4,2,2,2,2,2,2,2,1,1,2,2,1,2,2,2,2,,,2
1249525862,650,2,82,3,9,3,3,1,8,1,1,1,1,1,1,1,1,3,2,2,2,8,4000,7,0,3,2,24,2,6,6,3,1,,,,,,,1,3,1,2,24,1,6,6,3,1,,,,,,,1,3,1,1,1,1,1,1,8,,2,120,3,180,480,,1,2,2,2,1,2,1,2,2,2,,,,2,,,,,,,,,,,,,,2,2,9,2,9,9,2,2,2,,3,2,2,,2,,3,,,,,,,,2,,2,,2,1,56,166,1,2,2,2,7,1,3,2,2,"1,85714285714285714285714285714285714286",2,,2,,,,2,,1,1,"12,84","1","888","2",2,"888","888","888",2,3,1,2,2,,,,,4,,,,,,,,2,2,4,4,4,2,,1,2,2,1,2,2,2,2,2,2,2,2,2,2,2,,,,,,
2389880084,89,2,42,3,9,1,3,1,1,1,1,1,1,1,1,1,1,3,1,1,1,1,5000,9,1,4,1,76,6,5,3,2,1,,,,,,,1,1,1,1,76,5,5,3,2,1,,,,,,,1,1,2,1,1,1,1,1,8,,8,,8,,480,1,,,,,,3,1,2,2,2,,,,2,,,,,,,,,,,,,,2,2,2,2,2,2,2,1,1,,3,2,2,,1,1,2,1,1,2,1,5,1,1,1,1,2,,2,1,78,170,2,2,3,2,2,1,2,1,2,"0,5714285714285714285714285714285714285714",1,1,1,1,1,2,1,1,1,1,"21,4","888","1","888",2,"888","2","888",2,2,2,2,2,,,,,2,,,,,,,,1,2,4,4,1,,,,,,,2,2,2,2,1,2,2,2,2,1,1,2,2,2,,,2
2597930855,1587,2,14,2,2,1,3,1,2,1,1,1,1,1,1,3,1,3,2,3,3,3,7000,11,2,4,1,84,6,2,1,1,1,,,,,,,1,3,8,2,36,3,6,6,3,,,,,,,9,9,1,3,1,1,1,1,1,8,,8,,8,,360,2,,,,,,3,2,2,2,2,2,,,2,,,,,,,,,,,,,,2,2,2,2,2,2,2,2,7,,3,2,2,,1,2,9,,,,,,,,1,9,2,,2,2,58,171,1,1,3,2,3,1,2,1,2,"0,7142857142857142857142857142857142857143",2,,2,,,,2,,1,3,"","","","",,"","","",,,2,2,2,,,,,4,,,,,,,,2,2,4,4,1,2,,1,1,2,1,2,2,2,2,2,2,2,2,2,2,2,,,,,,
3889703970,214,2,30,3,9,3,3,1,2,2,1,1,1,1,1,1,1,3,2,1,1,1,6000,10,1,5,2,56,5,4,5,3,1,,,1,,,,1,1,1,2,56,4,4,5,3,1,,,1,,,,1,1,1,1,1,1,1,1,8,,8,,5,250,360,,2,2,2,1,2,2,2,2,2,2,2,,,2,,,,,,,,,,,,,,2,2,2,2,2,2,2,2,1,,3,2,2,,1,1,2,2,,,1,1,1,1,1,1,2,,1,1,55,151,1,2,3,1,7,1,7,2,2,"3",2,,2,,,,2,,1,1,"4,28","888","1","1",1,"888","888","888",2,2,2,2,2,,,,,1,,,,,,,,1,2,4,4,1,1,1,1,1,1,1,2,2,2,2,2,2,2,2,2,1,2,1,1,1,3,3,1
1001787745,3481,1,6,1,1,1,3,1,5,1,1,1,1,1,1,2,1,3,2,4,2,4,10000,12,0,4,1,52,5,1,7,3,1,,,,,,,1,1,2,2,40,3,1,7,3,1,,,,,,,1,1,1,1,1,1,1,1,2,120,1,60,2,20,120,,2,1,2,1,1,2,1,1,2,2,,,,1,18,1,3,,,,2,5,,,,,,1,2,1,2,2,2,2,1,1,,2,1,1,,1,1,3,,,,,,,,1,2,2,,2,1,84,178,2,2,1,1,4,5,2,3,2,"3,71428571428571428571428571428571428571",1,1,2,,,,1,2,1,1,"2","2","888","888",1,"3","888","888",2,2,2,2,2,,,,,1,,,,,,,,1,2,4,4,1,1,1,1,1,1,1,2,2,2,2,2,2,2,2,2,1,2,,,,,,
3836000580,406,4,54,3,9,1,3,1,4,1,2,1,1,1,1,2,1,3,3,6,2,4,3400,6,0,1,1,43,4,2,3,2,1,,,,,,,1,1,2,2,39,3,2,5,3,1,,,,,,,1,1,3,1,1,1,1,1,8,,8,,1,60,360,,2,2,2,2,1,3,2,2,2,2,1,1,3,2,,,,,,,,,,,,,,2,2,2,2,2,2,2,1,1,,3,2,2,,2,,3,,,,,,,,2,,2,,2,1,61,150,2,1,3,2,3,99,2,1,9,"",2,,2,,,,2,,2,,"","","","",,"","","",,,2,2,2,,,,,4,,,,,,,,2,2,3,1,1,2,,1,1,2,1,2,2,2,2,1,1,1,1,1,2,2,,,,,,
1278530766,187,4,54,3,9,1,3,2,6,1,2,1,1,1,1,3,1,3,2,2,1,6,1700,3,0,1,2,46,4,6,2,1,,,,,,1,,2,2,1,2,46,3,6,2,1,,,,,,1,,2,2,5,1,1,1,1,1,8,,8,,8,,120,9,,,,,,3,1,2,2,2,,,,2,,,,,,,,,,,,,,2,2,9,2,9,1,2,1,2,,3,2,1,,1,1,2,2,,,2,,,,1,1,2,,1,1,75,168,2,1,3,2,0,,2,1,2,"0,2857142857142857142857142857142857142857",1,1,2,,,,1,2,1,3,"","","","",,"","","",,,2,2,2,,,,,1,,,,,,,,1,2,4,4,3,1,4,1,1,2,1,2,2,2,2,2,2,2,2,2,2,2,,,,,,
305470914,339,6,26,4,9,2,1,2,6,1,1,1,1,1,1,1,1,1,1,4,2,4,2500,4,0,1,1,34,3,2,4,2,,,,,,1,,2,1,2,2,27,2,2,4,2,,,,,,1,,2,3,3,1,1,1,2,1,8,,8,,5,60,600,,2,1,2,1,2,3,1,1,2,2,,,,1,13,1,3,,,,1,3,,,,,,2,2,9,2,9,2,1,1,2,,2,1,1,,1,1,3,,,,,,,,1,2,1,2,2,1,110,165,3,1,2,2,0,,7,1,2,"1",2,,2,,,,2,,1,3,"","","","",,"","","",,,2,2,2,,,,,1,,,,,,,,1,2,4,4,3,2,,1,1,2,1,2,2,2,2,1,1,2,2,2,1,2,,,,,,
2877049652,70,2,42,3,9,1,2,1,1,1,1,1,1,1,1,1,1,2,1,2,2,2,5000,9,0,3,1,57,5,2,3,2,1,,,,,,,1,1,2,2,56,4,2,3,2,1,,,,,,,1,1,3,1,1,1,1,1,8,,8,,5,300,120,,1,1,2,1,1,2,1,1,2,2,,,,2,,,,,,,,,,,,,,2,2,2,2,9,2,2,1,1,,3,2,2,,2,,3,,,,,,,,2,,2,,2,1,57,155,1,2,3,2,2,1,2,1,2,"0,5714285714285714285714285714285714285714",2,,2,,,,2,,2,,"","","","",,"","","",,,2,2,2,,,,,1,,,,,,,,1,2,4,4,1,1,1,1,1,1,1,2,2,2,2,2,1,1,2,2,1,2,2,2,2,,,2
2898261479,102,3,46,4,9,3,1,1,2,1,2,1,1,1,1,1,2,1,1,2,2,6,2900,5,0,2,2,96,6,5,3,2,1,,,1,,,,1,3,3,2,34,2,5,4,2,,,,1,,,,2,1,4,1,1,1,1,1,8,,8,,3,180,240,,11,2,1,1,2,3,2,2,2,2,2,,,2,,,,,,,,,,,,,,2,2,2,9,9,2,2,2,2,,3,2,2,,1,2,3,,,,,,,,1,2,1,1,,1,69,155,2,1,3,2,1,1,3,1,2,"0,5714285714285714285714285714285714285714",2,,1,2,,,2,,1,3,"","","","",,"","","",,,2,2,2,,,,,2,,,,,,,,1,2,4,4,1,2,,1,2,2,1,2,2,2,2,1,2,2,2,2,2,2,,,,,,
3325552845,370,3,66,4,9,1,2,1,6,2,4,1,1,1,3,4,1,2,2,9,2,4,780,1,0,1,1,37,4,2,3,2,,,,,,1,,2,1,2,2,33,2,2,3,2,,,,,,1,,2,3,3,1,1,1,1,1,8,,8,,5,300,180,,2,2,2,1,2,2,2,2,2,2,2,,,2,,,,,,,,,,,,,,2,2,9,2,9,9,2,1,1,,3,2,2,,1,3,3,,,,,,,,2,2,2,,2,2,54,154,1,1,3,2,3,1,7,1,2,"1,42857142857142857142857142857142857143",2,,2,,,,2,,1,2,"","","","",,"","","",,,2,2,2,,,,,4,,,,,,,,2,2,4,4,4,2,,2,,2,2,2,2,2,2,1,2,2,1,2,1,2,,,,,,
1837000269,1136,4,22,3,9,1,4,1,4,1,2,1,1,1,1,1,1,4,2,6,3,7,7000,11,0,3,2,75,6,5,2,1,1,,,,,,,1,3,1,2,75,5,5,2,1,1,,,,,,,1,3,3,2,1,1,2,1,8,,8,,7,180,300,,6,1,2,1,1,3,2,2,2,2,1,2,4,2,,,,,,,,,,,,,,2,2,9,9,2,2,2,2,1,,3,2,2,,1,1,1,2,,,1,5,1,2,1,1,1,2,1,1,92,162,3,1,3,2,7,7,7,1,1,"8",1,1,2,,,,1,2,1,3,"","","","",,"","","",,,2,2,2,,,,,1,,,,,,,,1,2,4,4,3,1,3,1,4,2,2,2,2,2,2,2,1,2,2,2,9,2,2,2,2,,,2
3431330465,675,5,50,2,4,1,3,1,1,1,1,1,1,1,1,1,1,3,1,2,2,2,4800,9,0,3,1,78,6,2,5,3,1,,,,,,,1,3,2,2,69,5,2,5,3,1,,,,,,,1,3,3,1,1,1,2,1,8,,2,180,8,,240,,1,1,2,2,1,3,1,2,2,2,,,,2,,,,,,,,,,,,,,1,2,9,9,2,2,2,2,2,,3,2,2,,1,1,2,1,1,1,1,1,1,1,1,1,1,2,1,1,71,161,2,2,3,1,7,1,7,1,2,"2",1,1,2,,,,1,2,2,,"","","","",,"","","",,,2,2,1,2,1,1,1,1,1,1,1,1,2,1,2,1,1,4,4,1,1,2,1,2,1,1,2,2,2,2,2,1,2,2,2,1,1,2,2,2,,,2
555675813,99,6,26,3,9,1,4,1,1,1,1,1,1,1,1,1,1,4,2,1,1,1,5500,10,1,4,2,91,6,5,1,1,1,,,,,,,1,3,1,2,91,5,5,1,1,1,,,,,,,1,3,2,2,2,2,1,1,8,,8,,8,,240,5,,,,,,3,2,2,2,1,,,,2,,,,,,,,,,,,,,2,2,9,9,9,9,9,2,2,,3,2,2,,1,1,1,1,1,2,1,6,1,1,1,1,1,2,2,1,80,165,2,2,3,1,7,2,7,1,2,"3",1,1,2,,,,1,2,2,,"","","","",,"","","",,,2,2,2,,,,,1,,,,,,,,1,2,4,4,1,2,,2,,2,2,2,1,2,2,2,1,2,2,2,2,1,2,2,2,,,2
3085121938,119,3,10,4,9,1,4,1,1,1,2,1,1,1,1,2,1,4,3,7,5,5,7000,11,1,3,1,52,5,2,6,3,1,,,,,,,1,1,3,1,18,1,6,5,3,1,,,,,,,1,3,3,1,1,2,1,1,8,,7,420,7,840,600,,2,1,2,1,2,1,1,2,2,1,,,,2,,,,,,,,,,,,,,1,1,9,9,9,2,1,2,1,,3,2,1,,1,1,3,,,,,,,,1,2,2,,1,1,65,189,1,1,3,2,7,2,7,1,2,"3",2,,2,,,,2,,1,1,"4,28","6","888","4",2,"888","888","888",2,2,2,2,2,,,,,4,,,,,,,,2,2,4,4,2,,,,,,,2,2,2,2,1,1,2,1,1,1,2,,,,,,
2593096516,1975,4,22,4,9,1,3,2,4,2,2,1,1,1,1,2,1,3,3,2,2,6,1600,3,0,1,2,60,5,6,2,1,1,,,,,,,1,1,3,2,20,1,6,4,2,,,,,,1,,2,3,2,1,1,1,1,1,8,,8,,3,210,120,,3,1,2,1,1,3,2,2,2,2,2,,,2,,,,,,,,,,,,,,1,1,2,2,2,2,1,1,1,,3,2,1,,1,1,3,,,,,,,,1,2,2,,2,1,57,180,1,1,1,9,6,1,6,1,2,"1,71428571428571428571428571428571428571",2,,2,,,,2,,1,2,"","","","",,"","","",,,2,2,2,,,,,4,,,,,,,,2,2,3,4,2,2,,2,,2,2,2,2,2,2,1,2,2,9,9,1,1,,,,,,
431244902,299,4,34,4,9,1,6,2,4,2,2,2,1,1,2,1,1,6,4,8,4,7,2500,4,0,1,2,49,4,6,3,2,,,,,,1,,2,3,3,2,23,1,1,4,2,,,,,,1,,2,3,4,1,1,1,2,1,8,,8,,8,,240,9,,,,,,3,1,2,2,2,,,,2,,,,,,,,,,,,,,2,2,1,1,9,2,2,2,1,,3,2,1,,1,1,3,,,,,,,,1,2,2,,1,1,63,150,2,1,3,1,2,2,0,,2,"0,5714285714285714285714285714285714285714",1,1,2,,,,1,2,2,,"","","","",,"","","",,,2,2,2,,,,,1,,,,,,,,1,2,3,2,4,2,,1,2,2,1,2,2,2,1,1,1,1,1,1,1,1,,,,,,