"ID","REGION","PONDERA","CV01","CV02","CV03","CV04","CV05","CV06","CV07","CV08","CV09","CV10","CV11","HO01","HO02","HO03","CANTCOMPONENTES","TIPO_H","RANGO_INGRESO","INGRESO_AGRUPADO","EDAD","GRUPEDAD","PARENTESCO","VSEL01","VSEL02","VSEL03","VSEL04","VSEL05","VSEL06","NIVEL_INSTRUCCION","NIVEL_INSTRUCCION_AGRUPADO","VSEL07","VSEL08","VSEL09","VSEL10","VSEL11","VSEL11E","COND_ACT","VSEL12_01","VSEL12_02","VSEL12_03","VSEL12_04","VSEL12_05","VSEL12_09","COBERTURA_SALUD","VASA01_01","VASA01_02","VASA01_03","VASA01_04","VASA01_05","VASA01_06","VASA01_07","VASA01_08","VASA01_09","VASA01_10","VASA01_11","VASA01_12","VASA01_13","VASA01_14","VASA01_15","VASA01_16","VASA01_17","VASA01_18","VASA01_19","VASA01_19E","VASA02","VASA03","VASA04","VASA05","VASA06","VASA06E","VASA07","VASA08_01","VASA08_02","VASA08_03","VASA08_04","VASA08_05","VASA08_06","VASA08_06E","VASA09","VASA10_01","VASA10_02","VASA10_03","VASA10_04","VASA10_05","VASA10_06","VASA10_07","VASA10_08","VASA10_09","VASA10_10","VASA10_10E","VASA11","VASA12","VASA13","VASA13_01","VASA14","VASA15","VASA16_01","VASA16_01E","VASA16_01_AGRUPADO","VASA16_02_01","VASA16_02_02","VASA16_02_03","VASA16_02_04","VASA16_02_05","VASA16_02_06","VASA16_02_07","VASA16_02_08","VASA16_02_09","VASA16_02_10","VASA16_02_11","VASA16_02_12","VASA16_02_13","VASA16_02_14","VASA16_02_15","VASA16_02_16","VASA16_02_16E","VASA16_02_17","VASA16_02_AGRUPADO","VASA17","VASA17E","VASA18","VASA18E","VASA19","VASA20","VASA20E","VASA21_01","VASA21_02","VASA21_03","VASA21_04","VASA21_05","VASA21_06","VASA21_07","VASA21_08","VASA21_09","VASA21_10","VASA21_11","VASA21_12","VASA21_12E","VEP01","VEP02","VEP03","VEP04","VEP05","VEP05_01","VEP06","VEP06_01","VEP07","VEP08","VEP09","VEP09_01","VEP09_02","VEP09_03","VEP10","VEP11","VEP12_01","VEP12_02","VEP12_03","VEP12_04","VEP12_05","VEP12_06","VEP12_07","VEP12_08","VEP12_09","VEP12_10","VEP12_11","VEP12_12","VEP12_13","VEP12_14","VEP12_15","VEP12_16","VEP12_16E","VEP13","VEP14","VEP14_01","VEP14_02","VEP14_03","VITS01_01","VITS01_02","VITS01_03","VITS01_04","VITS01_05","VITS01_06","VITS01_07","VITS01_08","VITS01_09","VITS01_10","VITS02_01","VITS02_02","VITS02_03","VITS02_04","VITS02_05","VITS02_06","VITS02_09","VITS03","VITS04","VITS05","VITS06","VITS07","VITS08","VITS09","VITS09E","VITS10","VITS11","VITS12","VITS12E","VITS13","VITS14","VITS15","VITS16","VITS16E","VITS17","VITS18_01","VITS18_02","VITS18_03","VITS18_04","VITS18_05","VITS18_06","VITS18_07","VITS18_08","VITS18_08E","VITS18_09","VITS19","VITS20","VITS20E"
725016894,6,600,1,5,1,2,1,1,1,1,1,1,1,1,5,3,4,7,16,3,30,3,3,1,2,1,7,2,3,6,4,1,,,,,"",1,1,2,2,2,2,,1,0,1,1,1,0,1,0,0,0,0,0,0,0,0,0,0,0,0,0,"",1,19,1,18,4,"",1,1,2,2,2,2,2,"",,,,,,,,,,,,"",,,,,1,1,1,"",1,0,0,0,0,0,0,0,0,0,0,0,0,0,0,0,0,"",1,6,1,"",1,"",2,,"",,,,,,,,,,,,,"",1,1,1,1,2,,2,,2005,3,,,,,3,2,,,,,,,,,,,,,,,,,,1,99,,,99,1,1,1,1,1,2,2,2,2,1,1,0,0,0,0,0,0,2,2,2,2,1,2,3,"",2,,,"",2,2,,,"",2,,,,,,,,,"",,2,,""
271774567,6,222,1,2,1,4,1,1,1,1,1,1,1,1,2,2,5,6,14,2,18,1,3,6,1,,6,2,2,4,2,2,1,,,,"",3,1,2,2,2,2,,1,0,1,0,1,0,0,0,0,0,0,0,0,0,0,0,0,0,0,0,"",1,16,1,18,4,"",1,1,2,2,2,2,2,"",,,,,,,,,,,,"",,,,,2,,,"",,,,,,,,,,,,,,,,,,"",,,,"",,"",,,"",,,,,,,,,,,,,"",2,,,,,,,,,,,,,,,,,,,,,,,,,,,,,,,,,,,,,,2,2,1,2,2,2,2,2,2,2,1,0,0,0,0,0,0,9,2,2,2,2,,,"",2,,,"",2,2,,,"",2,,,,,,,,,"",,1,1,""
75528380,6,151,3,2,1,4,1,1,1,1,1,1,1,1,2,2,5,4,10,1,49,4,1,1,2,1,4,1,,3,1,1,,,,,"",1,1,2,2,2,2,,1,0,1,1,1,0,0,0,0,0,0,0,0,0,0,0,0,0,0,0,"",1,12,1,14,2,"",2,,,,,,,"",1,,,,,,,,,,,"",,18,2,,1,1,8,"",3,0,0,0,0,0,0,0,0,0,0,0,0,0,0,0,0,"",1,6,1,"",1,"",1,1,"",,,,,,,,,,,,,"",1,5,5,5,2,,2,,2012,1,,,,,2,1,1,0,0,0,0,0,0,0,0,0,0,0,0,0,0,0,,1,0,7,,,1,2,1,2,2,2,1,2,2,1,0,0,0,0,0,1,0,1,2,2,2,1,2,3,"",2,,,"",2,2,,,"",2,,,,,,,,,"",,1,1,""
39600522,6,370,1,3,2,4,2,1,1,1,1,1,1,1,3,3,6,4,4,1,57,5,1,2,2,1,6,2,3,4,2,2,1,,,,"",3,1,2,2,2,2,,1,0,1,0,1,0,0,0,0,0,0,0,0,0,0,0,0,0,0,0,"",1,14,1,25,10,"",2,,,,,,,"",1,,,,,,,,,,,"",,25,1,1,1,1,3,"",4,0,0,0,0,0,0,0,0,0,0,0,0,0,0,0,0,"",1,6,1,"",1,"",1,1,"",,,,,,,,,,,,,"",1,5,5,5,2,,2,,2003,1,,,,,1,2,,,,,,,,,,,,,,,,,,2,,,,,1,1,1,1,1,2,2,2,1,2,1,0,0,0,0,0,0,1,2,2,1,2,,,"",1,2,3,"",1,1,3,3,"",2,,,,,,,,,"",,1,2,""
826250329,6,370,1,3,2,4,2,1,1,1,1,1,1,1,3,3,6,4,4,1,19,1,3,6,2,1,6,1,,5,3,1,,,,,"",1,2,2,2,2,2,,2,0,1,0,1,0,0,0,0,0,0,0,0,0,0,0,0,0,0,0,"",1,16,1,18,10,"",1,1,2,2,2,2,2,"",,,,,,,,,,,,"",,,,,2,,,"",,,,,,,,,,,,,,,,,,"",,,,"",,"",,,"",,,,,,,,,,,,,"",2,,,,,,,,,,,,,,,,,,,,,,,,,,,,,,,,,,,,,,1,1,1,1,2,2,2,2,2,1,1,0,0,0,0,0,0,1,1,2,1,2,,,"",2,,,"",2,2,,,"",2,,,,,,,,,"",,1,2,""
866478969,6,370,1,3,2,4,2,1,1,1,1,1,1,1,3,3,6,4,4,1,25,2,3,6,2,1,6,2,5,4,2,2,1,,,,"",3,2,2,2,2,2,,2,0,1,0,1,0,0,0,0,1,0,0,0,1,0,0,0,0,0,0,"",1,15,1,17,2,"",2,,,,,,,"",1,,,,,,,,,,,"",,21,2,,1,1,3,"",4,0,0,0,0,0,0,0,0,0,0,0,0,0,0,0,0,"",1,6,2,"",1,"",1,1,"",,,,,,,,,,,,,"",1,1,1,1,2,,2,,2009,2,15,,15,,3,2,,,,,,,,,,,,,,,,,,2,,,,,1,1,1,1,1,2,1,2,2,1,1,0,0,0,0,0,0,1,1,1,2,2,,,"",2,,,"",2,2,,,"",1,0,1,0,0,0,0,0,0,"",0,1,2,""
427644327,6,964,1,3,2,2,2,2,1,1,1,1,1,1,3,2,7,5,5,1,46,4,1,2,2,1,4,2,6,2,1,1,,,,,"",1,2,2,2,2,2,,2,1,0,0,0,0,0,0,0,0,0,0,0,0,0,0,0,0,0,0,"",1,17,1,16,4,"",2,,,,,,,"",2,0,0,0,0,1,0,0,0,0,0,"",2,,,,,,,"",,,,,,,,,,,,,,,,,,"",,,,"",,"",,,"",,,,,,,,,,,,,"",1,7,7,7,2,,2,,2007,1,,,,,1,2,,,,,,,,,,,,,,,,,,2,,,,,2,1,1,2,2,2,2,2,2,1,1,0,0,0,0,0,0,9,1,2,1,2,,,"",2,,,"",2,2,,,"",2,,,,,,,,,"",,2,,""
513936964,6,70,1,2,1,4,1,1,1,1,1,1,2,1,2,2,4,4,16,3,18,1,3,6,2,1,6,2,1,4,2,1,,,,,"",1,1,2,2,2,2,,1,0,0,0,1,0,0,0,0,0,0,0,0,0,0,0,0,0,0,0,"",1,16,1,18,2,"",1,2,2,1,2,2,2,"",,,,,,,,,,,,"",,,,,1,1,3,"",4,0,0,0,0,0,0,0,0,0,0,0,0,0,0,0,0,"",1,6,2,"",1,"",2,,"",,,,,,,,,,,,,"",2,,,,,,,,,,,,,,,,,,,,,,,,,,,,,,,,,,,,,,2,2,1,2,2,2,2,2,2,2,1,0,0,0,0,0,0,1,9,2,2,2,,,"",2,,,"",9,2,,,"",2,,,,,,,,,"",,1,2,""
958260980,6,375,1,3,1,2,1,1,1,1,1,1,1,1,3,1,2,2,15,2,53,5,1,2,2,1,6,1,,5,3,1,,,,,"",1,1,2,2,1,2,,1,0,1,0,1,0,0,0,0,0,0,1,0,0,0,0,0,0,0,0,"",1,16,1,22,10,"",2,,,,,,,"",1,,,,,,,,,,,"",,18,2,,1,2,,"",,,,,,,,,,,,,,,,,,"",,,,"",,"",,,"",0,0,0,0,0,0,1,0,0,0,0,0,"",1,3,3,3,2,,2,,1994,1,,,,,1,1,0,1,0,0,0,0,0,0,0,0,0,0,0,0,0,0,,2,,,,,1,2,1,1,1,2,2,2,2,1,1,0,0,0,0,0,0,2,1,2,2,1,3,3,"",2,,,"",1,2,,,"",1,0,0,0,0,0,0,0,0,"",1,1,1,""
552806057,6,196,1,3,1,4,1,1,1,1,1,1,1,1,3,2,6,4,5,1,47,4,1,2,2,1,6,1,,5,3,1,,,,,"",1,2,2,2,2,2,,2,0,1,1,1,1,0,0,0,1,0,0,0,1,0,0,0,0,0,0,"",1,17,1,17,2,"",2,,,,,,,"",1,,,,,,,,,,,"",,18,2,,1,1,3,"",4,1,0,0,0,0,0,0,0,0,0,0,0,0,0,0,0,"",0,1,1,"",1,"",2,,"",,,,,,,,,,,,,"",1,6,6,6,2,,2,,2004,3,,,,,3,2,,,,,,,,,,,,,,,,,,2,,,,,1,1,1,1,2,2,2,2,2,1,1,1,0,0,0,0,0,2,2,2,2,1,3,9,"",2,,,"",2,2,,,"",2,,,,,,,,,"",,1,1,""
245725763,6,196,1,3,1,4,1,1,1,1,1,1,1,1,3,2,6,4,5,1,19,1,3,6,2,1,6,2,5,4,2,2,1,,,,"",3,2,2,2,2,2,,2,0,1,0,1,0,0,0,0,0,0,0,0,0,0,0,0,0,0,0,"",1,14,1,16,2,"",1,1,2,2,2,2,2,"",,,,,,,,,,,,"",,,,,1,1,3,"",4,1,0,0,0,0,0,0,0,0,0,0,0,0,0,0,0,"",0,1,2,"",1,"",2,,"",,,,,,,,,,,,,"",2,,,,,,,,,,,,,,,,,,,,,,,,,,,,,,,,,,,,,,2,2,1,9,2,2,2,2,2,1,1,0,0,0,0,0,0,1,1,9,2,2,,,"",2,,,"",1,2,,,"",2,,,,,,,,,"",,2,,""
440055326,6,109,1,4,1,4,1,1,1,1,1,1,1,1,4,3,5,4,7,1,14,1,3,6,1,,4,2,3,2,1,2,1,,,,"",3,1,2,2,2,2,,1,1,0,0,0,0,0,0,0,0,0,0,0,0,0,0,0,0,0,0,"",2,,,,,"",,,,,,,,"",,,,,,,,,,,,"",,,,,,,,"",,,,,,,,,,,,,,,,,,"",,,,"",,"",,,"",,,,,,,,,,,,,"",,,,,,,,,,,,,,,,,,,,,,,,,,,,,,,,,,,,,,,2,2,1,2,2,2,2,2,2,1,0,0,0,0,0,0,9,1,2,2,2,2,,,"",2,,,"",2,2,,,"",2,,,,,,,,,"",,2,,""
75592779,6,109,1,4,1,4,1,1,1,1,1,1,1,1,4,3,5,4,7,1,40,4,1,2,2,1,4,2,7,2,1,1,,,,,"",1,1,2,2,2,2,,1,0,1,1,0,0,0,0,0,0,0,0,0,0,0,0,0,0,0,0,"",1,99,1,99,4,"",2,,,,,,,"",2,0,0,0,0,0,0,0,1,0,0,"",2,,,,,,,"",,,,,,,,,,,,,,,,,,"",,,,"",,"",,,"",,,,,,,,,,,,,"",1,3,3,3,2,,2,,1999,1,,,,,1,2,,,,,,,,,,,,,,,,,,2,,,,,2,2,1,2,2,2,2,2,2,1,1,0,0,1,0,0,0,1,9,2,2,2,,,"",2,,,"",9,2,,,"",2,,,,,,,,,"",,2,,""
344182085,6,172,1,4,1,4,1,1,1,1,1,1,1,1,4,2,2,6,99,9,15,1,3,6,2,1,6,2,3,4,2,2,1,,,,"",3,1,2,2,2,2,,1,0,1,0,1,0,0,0,0,0,0,0,0,0,0,0,1,0,0,0,"",1,13,1,14,4,"",1,1,2,2,2,2,2,"",,,,,,,,,,,,"",,,,,1,1,1,"",1,0,0,1,0,0,0,0,0,0,0,0,0,0,0,0,0,"",0,4,3,"",8,"",2,,"",,,,,,,,,,,,,"",2,,,,,,,,,,,,,,,,,,,,,,,,,,,,,,,,,,,,,,2,2,1,2,2,2,2,2,2,1,1,0,0,0,0,0,0,9,1,1,1,1,1,3,"",2,,,"",1,2,,,"",2,,,,,,,,,"",,1,1,""
242806626,6,496,1,3,1,4,1,1,1,1,1,1,1,1,3,3,3,4,11,2,46,4,1,1,2,1,4,2,5,2,1,1,,,,,"",1,1,2,2,2,2,,1,0,1,0,1,0,0,0,0,0,0,0,0,0,0,0,0,0,0,0,"",1,99,1,99,4,"",2,,,,,,,"",2,0,0,0,0,0,0,0,1,0,0,"",2,,,,,,,"",,,,,,,,,,,,,,,,,,"",,,,"",,"",,,"",,,,,,,,,,,,,"",1,3,3,3,2,,2,,1996,3,,,,,4,2,,,,,,,,,,,,,,,,,,2,,,,,2,2,1,2,2,2,2,2,2,2,1,0,0,0,0,0,0,2,9,2,2,2,,,"",2,,,"",2,2,,,"",2,,,,,,,,,"",,1,1,""
482857632,6,610,1,3,1,4,1,1,1,1,1,1,1,1,3,2,3,6,99,9,42,4,1,3,2,1,6,1,,5,3,1,,,,,"",1,2,2,2,2,2,,2,0,1,1,1,0,1,0,0,0,0,1,0,0,0,0,0,0,0,0,"",1,17,1,17,3,"",1,1,2,2,2,2,2,"",,,,,,,,,,,,"",,,,,1,1,2,"",2,0,0,0,0,0,0,0,0,0,0,0,0,0,0,0,0,"",1,6,3,"",10,"LO USA DESDE ANTES DE CONOCER A SU PAREJA",9,,"",,,,,,,,,,,,,"",1,2,2,2,2,,2,,1993,2,1,,1,,4,1,0,1,0,0,0,0,0,0,0,0,0,0,0,0,0,0,,1,99,,,99,1,1,1,2,2,2,2,2,2,1,1,0,0,0,0,0,0,1,2,2,2,1,3,3,"",2,,,"",2,2,,,"",2,,,,,,,,,"",,2,,""
632687521,6,610,1,3,1,4,1,1,1,1,1,1,1,1,3,2,3,6,99,9,20,2,3,6,2,1,6,2,3,4,2,1,,,,,"",1,1,2,2,2,2,,1,0,1,0,1,0,0,0,0,0,0,0,0,0,0,0,0,0,0,0,"",1,15,1,17,4,"",1,1,2,2,2,2,2,"",,,,,,,,,,,,"",,,,,1,1,1,"",1,0,0,0,0,0,0,0,0,0,0,0,0,0,0,0,0,"",1,6,1,"",1,"",2,,"",,,,,,,,,,,,,"",2,,,,,,,,,,,,,,,,,,,,,,,,,,,,,,,,,,,,,,2,2,1,2,2,2,2,2,2,2,1,0,0,0,0,0,0,9,2,2,2,1,2,1,"",2,,,"",2,2,,,"",2,,,,,,,,,"",,1,1,""
365909155,6,351,1,3,2,2,1,1,1,1,1,1,3,1,3,2,4,4,7,1,19,1,3,6,2,1,6,2,4,4,2,1,,,,,"",1,2,2,2,2,2,,2,0,1,0,1,0,0,0,0,0,0,0,0,0,0,0,0,0,0,0,"",1,17,1,18,4,"",1,1,2,2,2,2,2,"",,,,,,,,,,,,"",,,,,2,,,"",,,,,,,,,,,,,,,,,,"",,,,"",,"",,,"",,,,,,,,,,,,,"",2,,,,,,,,,,,,,,,,,,,,,,,,,,,,,,,,,,,,,,2,2,1,2,1,2,2,2,1,1,1,0,0,0,0,0,0,2,1,1,9,2,,,"",2,,,"",1,2,,,"",1,0,0,0,0,0,0,0,0,"",1,1,1,""
754956485,6,158,1,4,1,4,1,1,1,1,1,1,1,1,4,3,7,5,17,3,19,1,3,6,2,1,5,2,2,4,2,2,2,,1,,"",2,1,2,2,2,2,,1,0,1,1,1,0,0,0,0,0,0,0,0,0,0,0,0,0,0,0,"",1,14,1,16,10,"",1,1,2,2,2,2,2,"",,,,,,,,,,,,"",,,,,1,1,3,"",4,0,0,0,0,0,0,0,0,0,0,0,0,0,0,0,0,"",1,6,2,"",2,"",2,,"",,,,,,,,,,,,,"",2,,,,,,,,,,,,,,,,,,,,,,,,,,,,,,,,,,,,,,2,2,1,2,2,2,2,2,2,1,1,0,0,0,0,0,0,1,2,2,2,2,,,"",2,,,"",1,2,,,"",2,,,,,,,,,"",,2,,""
631827227,6,158,1,4,1,4,1,1,1,1,1,1,1,1,4,3,7,5,17,3,54,5,1,2,2,1,4,2,5,2,1,2,4,1,,,"",1,1,2,2,2,2,,1,0,1,0,1,0,0,0,0,0,0,0,0,0,0,0,0,0,0,0,"",1,16,1,17,4,"",1,2,2,1,2,2,2,"",,,,,,,,,,,,"",,,,,1,2,,"",,,,,,,,,,,,,,,,,,"",,,,"",,"",,,"",0,0,0,0,0,0,1,0,0,0,0,0,"",1,3,3,3,2,,2,,1994,3,,,,,4,2,,,,,,,,,,,,,,,,,,2,,,,,2,2,1,2,2,2,2,2,2,2,0,1,0,0,0,0,0,1,1,2,2,2,,,"",1,2,3,"",1,2,,,"",2,,,,,,,,,"",,2,,""
668604691,6,158,1,4,1,4,1,1,1,1,1,1,1,1,4,3,7,5,17,3,21,2,3,1,2,1,6,2,2,4,2,2,2,,1,,"",2,2,2,2,2,2,,2,0,1,1,1,0,1,0,0,0,0,0,0,0,0,0,1,0,0,0,"",1,14,1,18,2,"",2,,,,,,,"",2,0,0,0,0,0,0,0,1,0,0,"",1,,,,,,,"",,,,,,,,,,,,,,,,,,"",,,,"",,"",,,"",,,,,,,,,,,,,"",2,,,,,,,,,,,,,,,,,,,,,,,,,,,,,,,,,,,,,,2,2,1,2,2,2,2,2,2,1,1,0,0,0,0,0,0,1,2,2,2,1,1,3,"",2,,,"",2,1,1,3,"",2,,,,,,,,,"",,2,,""
149016836,6,101,1,2,1,4,1,1,1,1,1,1,1,1,2,2,5,5,12,2,15,1,3,6,1,,6,2,3,4,2,1,,,,,"",1,1,2,2,2,2,,1,0,0,0,1,0,0,0,0,0,0,0,0,0,0,0,0,0,0,0,"",1,14,1,14,4,"",1,1,2,2,2,2,2,"",,,,,,,,,,,,"",,,,,2,,,"",,,,,,,,,,,,,,,,,,"",,,,"",,"",,,"",,,,,,,,,,,,,"",2,,,,,,,,,,,,,,,,,,,,,,,,,,,,,,,,,,,,,,2,2,1,2,2,2,9,9,9,1,1,0,0,0,0,0,0,1,2,2,1,2,,,"",2,,,"",9,9,,,"",2,,,,,,,,,"",,1,2,""
34558916,6,101,1,2,1,4,1,1,1,1,1,1,1,1,2,2,5,5,12,2,29,2,2,1,1,,6,2,3,4,2,1,,,,,"",1,1,2,2,2,2,,1,0,1,0,1,0,0,0,0,0,0,0,0,0,0,0,1,0,0,0,"",1,17,1,17,2,"",1,1,2,2,2,2,2,"",,,,,,,,,,,,"",,,,,1,1,2,"",2,0,0,0,0,0,0,0,0,0,0,0,0,0,0,0,0,"",1,6,3,"",1,"",1,1,"",,,,,,,,,,,,,"",1,2,1,1,2,,1,1,2006,1,,,,,1,2,,,,,,,,,,,,,,,,,,1,2,,2,,9,9,1,2,2,2,2,9,2,1,1,0,0,1,0,0,0,2,2,2,2,2,,,"",2,,,"",1,2,,,"",2,,,,,,,,,"",,1,2,""
584359588,6,609,1,7,2,4,1,1,1,1,1,1,1,1,7,5,12,5,12,2,23,2,7,6,1,,6,2,2,4,2,1,,,,,"",1,1,2,2,2,2,,1,0,0,0,1,0,0,0,0,0,0,0,0,0,0,0,0,0,0,0,"",2,,,,,"",,,,,,,,"",,,,,,,,,,,,"",,,,,,,,"",,,,,,,,,,,,,,,,,,"",,,,"",,"",,,"",,,,,,,,,,,,,"",,,,,,,,,,,,,,,,,,,,,,,,,,,,,,,,,,,,,,,2,2,1,2,2,2,9,9,2,1,0,0,0,0,0,1,0,2,2,2,2,9,,,"",9,,,"",1,9,,,"",2,,,,,,,,,"",,1,2,""
990183750,6,609,1,7,2,4,1,1,1,1,1,1,1,1,7,5,12,5,12,2,17,1,3,6,2,1,4,1,,3,1,1,,,,,"",1,2,2,2,2,2,,2,0,1,1,1,0,0,0,0,0,0,0,0,0,0,0,1,0,0,0,"",1,14,1,14,4,"",1,1,2,2,2,2,2,"",,,,,,,,,,,,"",,,,,1,1,3,"",4,0,0,0,0,0,0,0,0,0,0,0,0,0,0,0,0,"",1,6,2,"",1,"",2,,"",,,,,,,,,,,,,"",1,1,1,1,2,,2,,2007,1,,,,,3,1,1,0,0,0,0,0,0,0,0,0,0,0,0,0,0,0,,1,99,,,99,9,9,1,2,2,2,2,2,2,1,1,0,0,0,0,0,0,1,1,1,1,1,1,6,"",2,,,"",1,2,,,"",1,0,0,0,0,0,0,0,0,"",1,2,,""
7557015,6,609,1,7,2,4,1,1,1,1,1,1,1,1,7,5,12,5,12,2,28,2,3,1,2,1,6,2,2,4,2,1,,,,,"",1,2,2,2,2,2,,2,0,1,0,1,0,0,0,0,0,0,0,0,0,0,0,0,0,0,0,"",1,23,1,22,4,"",2,,,,,,,"",1,,,,,,,,,,,"",,23,2,,1,1,8,"",3,0,0,0,0,0,0,0,0,0,0,0,0,0,0,0,0,"",1,6,3,"",6,"",1,1,"",,,,,,,,,,,,,"",1,1,1,1,2,,2,,2012,1,,,,,1,1,1,0,0,0,0,0,0,0,0,0,0,0,0,0,0,0,,2,,,,,1,2,1,1,1,9,1,9,2,1,1,0,0,1,0,0,0,1,2,2,2,1,2,10,"PORQUE ESTABA EN MARCHA UNA CAMPA�A",1,1,6,"",2,2,,,"",2,,,,,,,,,"",,1,5,""
126307418,6,609,1,7,2,4,1,1,1,1,1,1,1,1,7,5,12,5,12,2,48,4,1,2,2,1,4,1,,3,1,1,,,,,"",1,1,2,2,2,2,,1,0,0,0,1,0,0,0,0,0,0,0,0,0,0,0,0,0,0,0,"",1,16,1,18,2,"",2,,,,,,,"",2,0,0,0,0,0,0,0,1,0,1,"POR VERGUENZA A PEDIRLO EN LOS CENTROS ASISTENCIALES",1,,,,,,,"",,,,,,,,,,,,,,,,,,"",,,,"",,"",,,"",,,,,,,,,,,,,"",1,9,9,9,2,,2,,1997,1,,,,,1,2,,,,,,,,,,,,,,,,,,2,,,,,2,2,1,2,9,9,9,9,2,1,1,0,0,0,0,0,0,1,2,2,2,1,9,3,"",2,,,"",1,2,,,"",2,,,,,,,,,"",,1,1,""
240541255,6,609,1,7,2,4,1,1,1,1,1,1,1,1,7,5,12,5,12,2,22,2,3,6,1,,4,1,,3,1,1,,,,,"",1,2,2,2,2,2,,2,0,1,0,1,0,0,0,0,0,0,0,0,0,0,0,0,0,0,0,"",1,15,1,15,2,"",2,,,,,,,"",2,0,0,0,0,1,0,0,0,0,0,"",1,,,,,,,"",,,,,,,,,,,,,,,,,,"",,,,"",,"",,,"",,,,,,,,,,,,,"",1,1,1,1,2,,2,,2011,1,,,,,1,2,,,,,,,,,,,,,,,,,,2,,,,,2,2,1,2,2,9,9,9,9,1,1,0,0,0,0,0,0,2,2,2,9,2,,,"",2,,,"",1,2,,,"",2,,,,,,,,,"",,1,1,""
339131327,6,217,1,3,1,4,1,1,1,1,1,1,1,1,3,3,5,5,12,2,56,5,1,2,2,1,6,2,4,4,2,2,1,,,,"",3,1,2,2,2,2,,1,0,1,1,1,0,0,0,0,1,0,1,0,0,0,0,0,0,0,0,"",1,15,1,99,2,"",2,,,,,,,"",1,,,,,,,,,,,"",,25,1,1,1,1,10,"",5,0,0,0,0,0,0,0,0,0,0,0,0,0,0,0,0,"",1,6,1,"",6,"",2,,"",,,,,,,,,,,,,"",1,4,4,4,2,,2,,1990,1,,,,,1,1,1,0,0,0,0,0,0,0,0,0,0,0,0,0,0,0,,2,,,,,1,1,1,1,2,2,1,2,1,1,1,1,0,0,0,0,0,1,2,2,2,2,,,"",2,,,"",2,2,,,"",1,0,1,0,0,0,0,0,0,"",0,1,1,""
862845457,6,516,1,4,1,5,1,1,1,1,1,1,1,1,4,3,2,6,99,9,26,2,3,6,1,,7,2,1,6,4,2,3,,1,,"",2,1,2,2,2,2,,1,0,1,1,1,0,0,0,0,0,0,0,0,0,0,0,1,0,0,0,"",1,17,1,28,2,"",1,1,2,2,2,2,2,"",,,,,,,,,,,,"",,,,,1,1,3,"",4,0,0,0,0,0,0,0,0,0,0,0,0,0,0,1,0,"",0,1,2,"",1,"",2,,"",,,,,,,,,,,,,"",2,,,,,,,,,,,,,,,,,,,,,,,,,,,,,,,,,,,,,,2,2,1,2,2,2,2,2,2,1,1,0,1,0,0,0,0,1,2,2,1,2,,,"",2,,,"",2,2,,,"",2,,,,,,,,,"",,2,,""
691869019,6,175,1,3,1,4,1,1,1,1,1,1,1,1,3,2,7,4,12,2,27,2,3,6,1,,7,2,4,6,4,1,,,,,"",1,2,2,2,2,2,,2,0,1,0,1,1,0,0,0,0,0,0,0,0,0,0,0,0,0,0,"",1,16,1,18,2,"",1,1,2,2,2,2,2,"",,,,,,,,,,,,"",,,,,1,1,3,"",4,0,0,0,0,0,0,0,0,0,0,0,0,0,0,0,0,"",1,6,2,"",1,"",1,1,"",,,,,,,,,,,,,"",2,,,,,,,,,,,,,,,,,,,,,,,,,,,,,,,,,,,,,,2,2,1,1,1,2,2,2,2,1,1,0,0,0,0,0,0,2,2,2,2,1,2,9,"",2,,,"",1,1,2,8,"",2,,,,,,,,,"",,2,,""
654034025,6,175,1,3,1,4,1,1,1,1,1,1,1,1,3,2,7,4,12,2,46,4,1,2,2,1,4,2,4,2,1,2,3,,1,,"",2,1,2,2,2,2,,1,0,1,0,0,0,0,0,0,0,0,0,0,0,0,0,0,0,0,0,"",1,99,1,99,9,"",2,,,,,,,"",1,,,,,,,,,,,"",,99,2,,1,1,8,"",3,0,0,0,0,0,0,0,0,0,0,0,0,0,0,0,0,"",1,6,1,"",6,"",2,,"",,,,,,,,,,,,,"",1,4,4,4,2,,2,,2006,1,,,,,1,2,,,,,,,,,,,,,,,,,,2,,,,,2,2,2,2,2,2,2,2,2,2,1,0,0,0,0,0,0,1,2,9,2,2,,,"",2,,,"",2,2,,,"",2,,,,,,,,,"",,1,2,""
150004142,6,552,1,2,1,4,1,1,1,1,1,1,1,1,2,2,1,1,17,3,30,3,1,6,2,1,4,1,,3,1,1,,,,,"",1,1,2,2,2,2,,1,0,1,1,1,0,0,0,0,0,0,0,0,0,0,0,0,0,0,0,"",1,14,1,14,2,"",1,1,2,1,2,2,2,"",,,,,,,,,,,,"",,,,,1,1,1,"",1,0,0,0,0,0,0,0,0,0,0,0,0,0,0,0,0,"",1,6,3,"",10,"DESCONOCE",2,,"",,,,,,,,,,,,,"",1,1,1,1,2,,2,,2002,1,,,,,1,2,,,,,,,,,,,,,,,,,,1,5,,5,,1,2,1,1,1,2,2,2,2,1,1,0,0,0,0,0,0,1,1,1,1,2,,,"",2,,,"",2,2,,,"",1,0,0,0,0,0,0,0,0,"",1,1,1,""
908282225,6,118,3,2,2,4,1,1,1,1,1,1,1,1,2,2,3,4,7,1,35,3,1,2,2,1,6,1,,5,3,1,,,,,"",1,1,2,2,2,2,,1,0,1,1,1,0,0,0,0,0,0,0,0,0,0,0,0,0,0,0,"",1,99,1,99,2,"",2,,,,,,,"",1,,,,,,,,,,,"",,18,2,,1,2,,"",,,,,,,,,,,,,,,,,,"",,,,"",,"",,,"",0,0,0,0,0,0,0,0,0,0,0,1,"RECIEN TUVO UN BEBE",1,1,1,1,2,,2,,2013,1,,,,,1,2,,,,,,,,,,,,,,,,,,1,2,,2,,1,1,1,1,2,2,1,2,2,1,1,0,0,0,0,0,0,2,2,2,2,1,1,9,"",2,,,"",2,2,,,"",1,0,0,0,0,0,0,0,0,"",1,2,,""
361078817,6,986,1,4,1,2,1,1,1,1,1,1,1,1,4,3,4,4,16,3,43,4,1,2,2,1,6,1,,5,3,1,,,,,"",1,1,2,2,1,2,,1,0,1,1,1,0,0,0,0,0,0,1,0,0,0,0,0,0,0,0,"",1,16,1,15,4,"",2,,,,,,,"",1,,,,,,,,,,,"",,18,2,,1,1,1,"",1,0,0,1,0,0,0,0,0,0,0,0,0,0,0,0,0,"",0,4,3,"",1,"",2,,"",,,,,,,,,,,,,"",1,2,2,2,2,,2,,2001,1,,,,,1,2,,,,,,,,,,,,,,,,,,2,,,,,1,1,1,1,2,2,2,2,2,1,1,0,0,0,0,0,0,2,2,2,2,1,1,3,"",1,1,3,"",1,2,,,"",2,,,,,,,,,"",,1,2,""
128577330,6,203,1,5,1,2,1,1,1,1,1,1,1,1,5,3,5,4,12,2,17,1,3,6,1,,6,2,6,4,2,2,1,,,,"",3,1,2,2,2,2,,1,0,1,1,1,0,0,0,0,1,0,0,0,0,0,0,0,0,0,0,"",1,99,1,15,2,"",1,1,2,1,2,2,2,"",,,,,,,,,,,,"",,,,,2,,,"",,,,,,,,,,,,,,,,,,"",,,,"",,"",,,"",,,,,,,,,,,,,"",2,,,,,,,,,,,,,,,,,,,,,,,,,,,,,,,,,,,,,,2,2,1,1,1,2,2,2,1,1,0,1,0,0,0,0,0,9,9,2,2,2,,,"",2,,,"",2,2,,,"",2,,,,,,,,,"",,1,1,""
407647965,6,203,1,5,1,2,1,1,1,1,1,1,1,1,5,3,5,4,12,2,48,4,1,2,2,1,6,2,4,4,2,1,,,,,"",1,1,2,2,2,2,,1,0,1,1,1,0,0,0,0,0,0,1,0,0,0,0,0,0,0,0,"",1,15,1,15,2,"",2,,,,,,,"",1,,,,,,,,,,,"",,18,2,,1,1,8,"",3,0,0,0,0,0,0,0,0,0,0,0,0,0,0,0,0,"",1,6,1,"",1,"",1,4,"",,,,,,,,,,,,,"",1,3,3,3,2,,2,,2009,1,,,,,1,2,,,,,,,,,,,,,,,,,,2,,,,,1,1,1,2,2,1,2,2,2,1,1,0,0,0,0,1,0,2,1,1,2,1,3,3,"",2,,,"",2,1,3,3,"",2,,,,,,,,,"",,1,1,""
844007179,4,5725,1,3,2,4,1,2,1,1,1,1,1,1,3,2,4,4,6,1,20,2,3,1,1,,7,2,1,6,4,2,1,,,,"",3,2,2,2,2,2,,2,0,1,0,1,0,1,0,0,0,0,0,0,0,0,0,0,0,0,0,"",1,14,1,16,2,"",1,1,2,2,2,2,2,"",,,,,,,,,,,,"",,,,,1,1,1,"",1,0,0,0,0,0,0,0,0,0,0,0,0,0,0,0,0,"",1,6,1,"",1,"",2,,"",,,,,,,,,,,,,"",2,,,,,,,,,,,,,,,,,,,,,,,,,,,,,,,,,,,,,,1,1,1,2,1,1,2,2,2,1,1,0,0,0,0,0,0,1,1,2,2,2,,,"",2,,,"",1,2,,,"",2,,,,,,,,,"",,1,1,""
406753554,4,5725,1,3,2,4,1,2,1,1,1,1,1,1,3,2,4,4,6,1,47,4,1,2,2,1,4,2,3,2,1,1,,,,,"",1,2,2,2,2,2,,2,0,1,0,1,0,0,0,0,0,0,0,0,0,0,0,0,0,0,0,"",1,16,1,16,4,"",1,1,2,2,2,2,2,"",,,,,,,,,,,,"",,,,,1,1,1,"",1,0,0,0,0,0,0,0,0,0,0,0,0,0,0,0,0,"",1,6,1,"",6,"",2,,"",,,,,,,,,,,,,"",1,2,2,2,2,,2,,2002,1,,,,,1,1,1,0,0,0,0,0,0,0,0,0,0,0,0,0,0,0,,1,99,,,99,2,2,1,2,2,2,2,2,2,1,1,0,0,0,0,0,0,9,1,1,1,2,,,"",2,,,"",2,1,3,7,"",2,,,,,,,,,"",,1,1,""
591278867,4,2000,1,2,2,4,1,2,2,1,1,2,3,1,2,1,6,4,4,1,14,1,3,6,1,,4,2,7,2,1,1,,,,,"",1,2,2,2,2,2,,2,0,1,0,1,0,0,0,0,1,0,0,0,0,0,0,0,0,0,0,"",2,,,,,"",,,,,,,,"",,,,,,,,,,,,"",,,,,,,,"",,,,,,,,,,,,,,,,,,"",,,,"",,"",,,"",,,,,,,,,,,,,"",,,,,,,,,,,,,,,,,,,,,,,,,,,,,,,,,,,,,,,2,2,1,2,2,2,2,2,2,1,1,0,0,0,0,0,0,2,1,1,2,2,,,"",1,2,3,"",1,2,,,"",2,,,,,,,,,"",,1,2,""
271715996,4,2000,1,2,2,4,1,2,2,1,1,2,3,1,2,1,6,4,4,1,33,3,1,2,2,1,4,1,,3,1,1,,,,,"",1,2,2,2,2,2,,2,0,1,1,1,0,0,0,0,1,0,0,0,0,0,0,0,0,0,0,"",1,17,1,14,4,"",2,,,,,,,"",1,,,,,,,,,,,"",,19,1,2,1,1,8,"",3,0,0,0,0,0,0,0,0,0,0,0,0,0,0,0,0,"",1,6,3,"",6,"",1,1,"",,,,,,,,,,,,,"",1,5,5,5,2,,2,,2006,1,,,,,1,2,,,,,,,,,,,,,,,,,,2,,,,,2,2,1,2,2,2,2,2,2,2,1,0,0,0,0,0,0,1,1,1,2,2,,,"",2,,,"",1,2,,,"",2,,,,,,,,,"",,1,2,""
698148741,1,11747,3,3,1,1,1,1,1,1,1,1,1,1,3,2,2,8,12,2,20,2,5,6,1,,7,2,2,6,4,1,,,,,"",1,2,1,2,2,2,,1,0,1,0,1,0,0,0,0,0,0,0,0,0,0,0,0,0,0,0,"",1,17,1,17,2,"",1,1,2,2,2,2,2,"",,,,,,,,,,,,"",,,,,2,,,"",,,,,,,,,,,,,,,,,,"",,,,"",,"",,,"",,,,,,,,,,,,,"",2,,,,,,,,,,,,,,,,,,,,,,,,,,,,,,,,,,,,,,1,2,1,2,2,2,2,2,2,1,1,0,0,0,0,0,0,2,2,2,2,2,,,"",2,,,"",2,2,,,"",2,,,,,,,,,"",,2,,""
783762311,1,11747,3,3,1,1,1,1,1,1,1,1,1,1,3,2,2,8,12,2,21,2,1,6,1,,8,2,2,6,4,1,,,,,"",1,2,1,2,1,2,,1,0,1,1,1,0,0,0,0,1,0,0,0,0,0,0,0,0,0,0,"",1,17,1,17,4,"",1,1,2,2,2,2,2,"",,,,,,,,,,,,"",,,,,1,1,3,"",4,1,0,0,0,0,0,0,0,0,0,0,0,0,0,0,0,"",0,1,1,"",9,"",2,,"",,,,,,,,,,,,,"",2,,,,,,,,,,,,,,,,,,,,,,,,,,,,,,,,,,,,,,2,1,1,1,2,2,2,2,2,1,1,0,0,0,0,0,0,9,2,2,2,2,,,"",1,1,3,"",1,2,,,"",2,,,,,,,,,"",,1,6,"CRISTIANA"
163954981,1,3119,3,2,1,2,1,1,1,1,1,1,1,1,2,1,2,8,5,1,25,2,1,6,1,,8,2,4,6,4,2,3,,2,5,"DA CLASES ESPORADICAMENTE",3,1,2,2,2,2,,1,0,1,1,1,0,0,0,0,0,0,0,0,0,0,0,0,0,0,0,"",1,15,1,14,4,"",1,1,2,2,2,2,2,"",,,,,,,,,,,,"",,,,,1,1,3,"",4,0,0,0,0,0,0,0,0,0,0,0,0,0,0,0,0,"",1,6,1,"",10,"PREVIENE ENFERMEDADES",2,,"",,,,,,,,,,,,,"",2,,,,,,,,,,,,,,,,,,,,,,,,,,,,,,,,,,,,,,1,1,1,1,1,2,1,2,1,1,1,0,0,0,0,0,0,2,2,2,2,1,2,3,"",1,2,3,"",1,2,,,"",1,0,0,0,0,0,0,0,0,"",1,1,1,""
259727969,1,3148,3,3,1,2,1,1,1,1,1,1,1,1,3,1,2,2,99,9,31,3,1,1,2,1,8,1,,7,4,1,,,,,"",1,2,1,2,2,2,,1,0,1,1,1,0,1,0,0,0,0,0,0,0,0,0,0,0,0,0,"",1,15,1,99,2,"",1,1,2,2,2,2,2,"",,,,,,,,,,,,"",,,,,1,1,3,"",4,0,0,0,0,0,0,0,0,0,0,0,0,0,0,0,0,"",1,6,1,"",9,"",2,,"",,,,,,,,,,,,,"",2,,,,,,,,,,,,,,,,,,,,,,,,,,,,,,,,,,,,,,1,1,1,1,2,2,2,2,2,1,1,0,0,0,0,0,0,2,2,2,2,1,2,9,"",2,,,"",2,2,,,"",1,0,0,0,0,0,0,0,0,"",1,2,,""
24779034,1,2500,3,4,1,1,1,1,1,1,1,1,1,1,4,2,3,4,17,3,22,2,3,6,1,,8,2,3,6,4,1,,,,,"",1,2,1,2,2,2,,1,0,1,0,1,0,0,0,0,0,0,0,0,0,0,0,0,0,0,0,"",1,16,1,16,4,"",1,1,2,2,2,2,2,"",,,,,,,,,,,,"",,,,,1,1,3,"",4,0,0,0,0,0,0,0,0,0,0,0,0,0,0,0,0,"",1,6,2,"",10,"ES EL QUE TE ENSE�AN A USAR EN LA ESCUELA Y EN LA FAMILIA",2,,"",,,,,,,,,,,,,"",2,,,,,,,,,,,,,,,,,,,,,,,,,,,,,,,,,,,,,,1,9,1,1,1,2,2,2,2,1,1,0,0,0,0,0,0,2,2,2,2,2,,,"",2,,,"",1,2,,,"",1,0,1,0,0,0,1,0,0,"",0,2,,""
972980011,1,7699,3,2,1,2,1,1,1,1,1,1,1,1,2,1,3,4,99,9,35,3,2,1,2,1,6,1,,5,3,1,,,,,"",1,2,2,2,2,2,,2,0,1,1,1,0,0,0,0,0,0,0,0,0,0,0,0,0,0,0,"",1,15,1,30,11,"",1,1,2,2,2,2,2,"",,,,,,,,,,,,"",,,,,1,1,10,"",5,0,0,0,0,0,0,0,0,0,0,0,0,0,0,0,0,"",1,6,1,"",9,"",1,1,"",,,,,,,,,,,,,"",1,1,1,1,2,,2,,2009,1,,,,,1,2,,,,,,,,,,,,,,,,,,2,,,,,1,1,1,1,1,2,2,2,2,1,1,0,0,0,0,0,0,2,2,2,2,2,,,"",2,,,"",2,2,,,"",1,0,1,0,0,0,0,0,0,"",0,1,1,""
980453179,1,4466,3,2,1,8,2,1,1,1,1,1,1,1,2,1,1,1,11,2,37,3,1,4,2,1,7,1,,7,4,1,,,,,"",1,1,2,2,2,2,,1,0,1,1,1,1,0,0,0,1,0,1,1,1,0,0,0,0,0,1,"PRESERVATIVO INTERNO DE MUJER.",1,17,1,17,4,"",1,1,2,2,2,2,2,"",,,,,,,,,,,,"",,,,,1,1,1,"",1,0,0,0,0,0,0,0,0,0,0,0,0,0,0,0,0,"",1,6,3,"",1,"",2,,"",,,,,,,,,,,,,"",1,1,1,1,2,,2,,1999,1,,,,,1,2,,,,,,,,,,,,,,,,,,1,2,,2,,1,1,1,1,1,2,2,2,2,1,1,0,0,0,0,0,0,2,2,2,2,1,1,9,"",2,,,"",2,2,,,"",1,0,0,0,0,0,0,0,0,"",1,1,1,""
982181208,1,4462,3,4,1,2,1,1,1,1,1,1,1,1,4,2,2,6,16,3,28,2,3,6,1,,8,2,2,6,4,1,,,,,"",1,1,2,2,2,2,,1,0,1,0,1,0,0,0,0,0,0,0,0,0,0,0,0,0,0,0,"",1,17,1,17,4,"",1,1,2,2,2,2,2,"",,,,,,,,,,,,"",,,,,1,1,3,"",4,0,0,0,0,0,0,0,0,0,0,0,0,0,0,0,0,"",1,6,2,"",1,"",2,,"",,,,,,,,,,,,,"",2,,,,,,,,,,,,,,,,,,,,,,,,,,,,,,,,,,,,,,1,2,1,1,2,1,2,2,2,1,1,1,0,0,0,0,0,1,2,2,2,2,,,"",2,,,"",1,2,,,"",2,,,,,,,,,"",,2,,""
206735578,1,3952,1,1,1,2,1,1,1,1,1,1,1,1,1,1,2,2,12,2,31,3,2,2,2,1,8,2,1,6,4,1,,,,,"",1,1,2,2,2,2,,1,0,1,0,1,0,0,0,1,0,0,0,0,0,0,0,0,0,0,0,"",1,17,1,16,4,"",1,1,2,2,2,2,2,"",,,,,,,,,,,,"",,,,,1,1,1,"",1,0,0,0,0,0,0,0,0,0,0,0,0,0,0,0,0,"",1,6,1,"",9,"",1,4,"",,,,,,,,,,,,,"",2,,,,,,,,,,,,,,,,,,,,,,,,,,,,,,,,,,,,,,1,2,1,1,1,2,2,2,2,1,1,0,1,0,0,0,0,2,2,2,2,1,2,3,"",2,,,"",9,2,,,"",1,1,0,0,0,0,0,0,0,"",0,1,2,""
753953787,1,3363,1,5,1,4,1,1,1,1,1,1,1,1,5,4,7,7,16,3,32,3,7,2,2,1,1,1,,1,1,1,,,,,"",1,1,2,2,2,2,,1,0,1,0,1,0,0,0,0,0,0,0,0,0,0,0,0,0,0,0,"",1,16,1,18,2,"",2,,,,,,,"",1,,,,,,,,,,,"",,17,2,,1,1,1,"",1,0,0,0,0,0,0,0,0,0,0,0,0,0,0,0,0,"",1,6,1,"",1,"",2,,"",,,,,,,,,,,,,"",1,2,2,2,2,,2,,2011,1,,,,,1,2,,,,,,,,,,,,,,,,,,1,3,,3,,1,2,1,1,2,2,2,2,1,1,1,1,0,0,0,0,0,2,2,2,2,1,2,3,"",1,2,3,"",2,2,,,"",2,,,,,,,,,"",,2,,""
667511674,1,3363,1,5,1,4,1,1,1,1,1,1,1,1,5,4,7,7,16,3,39,3,3,6,2,1,4,1,,3,1,1,,,,,"",1,1,2,2,2,2,,1,0,1,0,1,0,0,0,0,0,0,0,1,0,0,0,0,0,0,0,"",1,15,1,20,11,"",1,1,2,2,2,2,2,"",,,,,,,,,,,,"",,,,,1,1,3,"",4,0,0,0,0,0,0,0,0,0,0,0,0,0,0,0,0,"",1,6,2,"",1,"",2,,"",,,,,,,,,,,,,"",1,1,1,1,2,,2,,1997,2,4,,4,,2,2,,,,,,,,,,,,,,,,,,2,,,,,1,2,1,2,2,2,2,2,2,1,1,0,0,0,0,0,0,2,2,2,2,1,2,3,"",2,,,"",2,2,,,"",2,,,,,,,,,"",,2,,""