"ID","REGION","PONDERA","CV01","CV02","CV03","CV04","CV05","CV06","CV07","CV08","CV09","CV10","CV11","HO01","HO02","HO03","CANTCOMPONENTES","TIPO_H","RANGO_INGRESO","INGRESO_AGRUPADO","EDAD","GRUPEDAD","PARENTESCO","MSEL01","MSEL02","MSEL03","MSEL04","MSEL05","MSEL06","NIVEL_INSTRUCCION","NIVEL_INSTRUCCION_AGRUPADO","MSEL07","MSEL08","MSEL09","MSEL10","MSEL11","MSEL11E","COND_ACT","MSEL12_01","MSEL12_02","MSEL12_03","MSEL12_04","MSEL12_05","MSEL12_09","COBERTURA_SALUD","MASA01_01","MASA01_02","MASA01_03","MASA01_04","MASA01_05","MASA01_06","MASA01_07","MASA01_08","MASA01_09","MASA01_10","MASA01_11","MASA01_12","MASA01_13","MASA01_14","MASA01_15","MASA01_16","MASA01_17","MASA01_18","MASA01_18E","MASA02","MASA03","MASA04","MASA05","MASA06","MASA06E","MASA07","MASA08_01","MASA08_02","MASA08_03","MASA08_04","MASA08_05","MASA08_06","MASA08_06E","MASA09","MASA10_01","MASA10_02","MASA10_03","MASA10_04","MASA10_05","MASA10_06","MASA10_07","MASA10_08","MASA10_09","MASA10_10","MASA10_10E","MASA11","MASA12","MASA13","MASA14","MASA14_01","MASA15","MASA16","MASA17_01","MASA17_01E","MASA17_01_AGRUPADO","MASA17_02_01","MASA17_02_02","MASA17_02_03","MASA17_02_04","MASA17_02_05","MASA17_02_06","MASA17_02_07","MASA17_02_08","MASA17_02_09","MASA17_02_10","MASA17_02_11","MASA17_02_12","MASA17_02_13","MASA17_02_14","MASA17_02_15","MASA17_02_16","MASA17_02_16E","MASA17_02_17","MASA17_02_AGRUPADO","MASA18","MASA18E","MASA19","MASA19E","MASA20","MASA21","MASA21E","MASA22_01","MASA22_02","MASA22_03","MASA22_04","MASA22_05","MASA22_06","MASA22_07","MASA22_08","MASA22_09","MASA22_10","MASA22_11","MASA22_12","MASA22_12E","MPR01","MPR02","MPR03","MPR04","MPR04E","MPR05","MPR05E","MPR06","MPR07","MEP01","MEP02","MEP03","MEP04","MEP05","MEP05_01","MEP06","MEP06_01","MEP07","MEP08","MEP09","MEP10","MEP11","MEP12","MEP12_01","MEP12_02","MEP12_03","MEP13","MEP14","MEP15_01","MEP15_02","MEP15_03","MEP15_04","MEP15_05","MEP15_06","MEP15_07","MEP15_08","MEP15_09","MEP15_10","MEP15_11","MEP15_12","MEP15_13","MEP15_14","MEP15_15","MEP15_16","MEP15_16E","MEP16","MEP17","MEP17_01","MEP17_02","MEP17_03","MEP18","MEP19","MEP19E","MEP20","MEP21","MEP22","MEP23","MEP24","MEP24_01","MEP24_02","MEP24_03","MLA01","MLA02","MLA02_01","MLA02_02","MLA02_03","MLA03","MLA03E","MLA04_01","MLA04_02","MLA04_03","MITS01_01","MITS01_02","MITS01_03","MITS01_04","MITS01_05","MITS01_06","MITS01_07","MITS01_08","MITS01_09","MITS01_10","MITS02_01","MITS02_02","MITS02_03","MITS02_04","MITS02_05","MITS02_06","MITS02_09","MITS03","MITS04","MITS05","MITS06","MITS07","MITS08","MITS09","MITS09E","MITS10","MITS11","MITS12","MITS12E","MITS13","MITS14","MITS15","MITS16","MITS16E","MITS17","MITS18_01","MITS18_02","MITS18_03","MITS18_04","MITS18_05","MITS18_06","MITS18_07","MITS18_07E","MITS18_09","MITS19","MITS20","MITS20E"
11667169,6,183,1,3,1,4,1,1,1,1,1,1,1,1,3,2,4,4,16,3,45,4,2,1,2,1,8,1,,7,4,1,,,,,"",1,1,2,2,2,2,,1,0,1,1,1,1,1,1,0,1,0,0,0,1,0,0,0,0,0,"",1,19,1,19,3,"",1,1,2,2,2,2,2,"",,,,,,,,,,,,"",,,,,,1,1,1,"",1,0,0,0,0,0,0,0,0,0,0,0,0,0,0,0,0,,1,6,1,"",1,"",2,,"",,,,,,,,,,,,,"",1,1,2,,"",,"",3,1,1,2,2,2,2,,2,,,,,2001,1,,,,,1,2,,,,,,,,,,,,,,,,,"",1,2,,2,,2,2,"",1,2,2,2,,,,,1,1,,1,,1,"",1,1,6,1,1,1,1,1,1,1,1,1,1,1,0,0,0,0,0,0,2,2,2,2,1,1,4,"",1,1,4,"",1,2,,,"",1,0,1,0,0,0,0,0,"",0,1,1,""
277051581,6,253,1,4,1,3,1,1,1,1,1,1,1,1,4,3,3,4,17,3,17,1,3,6,1,,6,2,4,4,2,2,1,,,,"",3,1,2,1,2,2,,1,0,1,1,1,0,1,0,0,0,0,0,0,0,0,0,0,0,0,"",1,15,1,15,1,"",1,1,2,2,2,2,2,"",,,,,,,,,,,,"",,,,,,1,1,1,"",1,0,0,1,0,0,0,0,0,0,0,0,0,0,0,0,0,,0,4,2,"",1,"",2,,"",,,,,,,,,,,,,"",2,,,,"",7,"",,2,2,,,,,,,,,,,,,,,,,,,,,,,,,,,,,,,,,,,"",,,,,,,,"",,,,,,,,,,,,,,,"",,,,1,1,1,1,2,2,2,1,2,1,1,0,0,0,0,0,0,1,2,2,2,2,,,"",2,,,"",1,2,,,"",1,0,0,0,0,0,0,0,"",1,2,,""
360154084,6,175,1,2,1,4,1,1,1,1,1,1,1,1,2,2,4,4,7,1,35,3,2,1,2,1,6,2,4,4,2,1,,,,,"",1,1,2,2,2,2,,1,0,1,1,1,0,1,0,0,0,0,0,0,0,0,0,0,0,0,"",1,13,1,17,1,"",2,,,,,,,"",1,,,,,,,,,,,"",,21,1,1,1,1,1,3,"",4,0,0,0,0,0,0,0,0,0,0,0,0,0,0,0,0,,1,6,1,"",1,"",2,,"",,,,,,,,,,,,,"",1,1,2,,"",,"",1,2,1,2,2,2,2,,2,,,,,1995,1,,,,,1,2,,,,,,,,,,,,,,,,,"",1,1,,1,,2,1,"",2,2,2,1,0,6,,,1,11,,11,,1,"",11,6,6,1,1,1,2,2,2,2,1,2,1,1,0,0,0,0,0,0,2,2,2,2,1,3,4,"",2,,,"",2,2,,,"",2,,,,,,,,"",,1,2,""
10146341,6,114,1,2,1,4,1,1,1,1,1,1,1,1,2,2,3,6,12,2,16,1,3,6,1,,6,2,4,4,2,2,1,,,,"",3,1,2,1,2,2,,1,0,1,0,0,0,0,0,0,1,0,1,0,0,0,0,0,0,0,"",2,,,,,"",,,,,,,,"",,,,,,,,,,,,"",,,,,,,,,"",,,,,,,,,,,,,,,,,,,,,,"",,"",,,"",,,,,,,,,,,,,"",2,,,,"",10,"",,2,2,,,,,,,,,,,,,,,,,,,,,,,,,,,,,,,,,,,"",,,,,,,,"",,,,,,,,,,,,,,,"",,,,2,2,1,2,1,2,2,2,2,1,1,0,0,0,0,0,0,1,2,2,2,2,,,"",2,,,"",1,2,,,"",2,,,,,,,,"",,2,,""
628334073,6,191,3,3,1,4,1,1,1,1,1,1,1,1,3,3,10,5,99,9,21,2,3,6,2,1,6,2,4,4,2,2,2,,1,,"",2,2,2,2,2,2,,2,0,1,0,1,0,0,0,0,0,0,0,0,0,0,0,0,0,0,"",1,16,1,21,3,"",2,,,,,,,"",1,,,,,,,,,,,"",,18,1,1,1,2,,,"",,,,,,,,,,,,,,,,,,,,,,"",,"",,,"",,,,,,,,,,,,,"",1,1,1,,"",,"",2,2,1,1,1,1,2,,2,,,,,2009,1,,,,,1,2,,,,,,,,,,,,,,,,,"",1,1,,1,,2,1,"",1,1,2,2,,,,,1,48,,48,,5,"",24,99,9,2,2,1,2,2,2,2,2,2,2,1,0,0,0,0,0,0,9,1,1,9,2,,,"",9,,,"",1,1,2,1,"",2,,,,,,,,"",,2,,""
524876423,6,173,1,3,2,1,1,1,1,1,1,1,1,1,3,2,5,6,11,2,41,4,1,3,2,1,4,1,,3,1,1,,,,,"",1,1,2,2,2,2,,1,0,1,1,1,0,0,0,0,0,0,0,0,0,0,0,0,0,0,"",1,14,1,19,3,"",2,,,,,,,"",1,,,,,,,,,,,"",,20,1,1,2,2,,,"",,,,,,,,,,,,,,,,,,,,,,"",,"",,,"",,,,,,,,,,,,,"",1,1,2,,"",,"",3,1,1,6,5,5,2,,1,1,1,1,1,2002,1,,,,,1,2,,,,,,,,,,,,,,,,,"",1,1,2,,,2,2,"",1,1,2,2,,,,,1,18,,18,,4,"",18,1,6,1,2,1,1,1,2,2,2,2,1,1,0,0,0,0,0,0,2,2,2,2,1,1,4,"",1,2,4,"",1,1,2,4,"",2,,,,,,,,"",,1,1,""
812641808,6,173,1,3,2,1,1,1,1,1,1,1,1,1,3,2,5,6,11,2,19,1,3,6,2,1,6,1,,5,3,1,,,,,"",1,2,2,2,2,2,,2,0,1,1,1,0,0,0,0,0,0,0,0,0,0,0,0,1,0,"",1,14,1,17,3,"",1,1,2,2,2,2,2,"",,,,,,,,,,,,"",,,,,,2,,,"",,,,,,,,,,,,,,,,,,,,,,"",,"",,,"",,,,,,,,,,,,,"",1,1,1,,"",,"",1,2,2,,,,,,,,,,,,,,,,,,,,,,,,,,,,,,,,,,,"",,,,,,,,"",,,,,,,,,,,,,,,"",,,,1,1,1,1,2,2,1,2,2,1,1,0,0,0,0,0,0,1,2,2,2,1,1,1,"",1,1,1,"",2,1,1,1,"",1,0,0,0,0,0,0,0,"",1,1,1,""
73025523,6,395,1,1,1,4,1,1,2,1,1,2,1,1,1,1,4,4,7,1,46,4,2,1,2,1,4,1,,3,1,2,1,,,,"",3,2,2,2,2,2,,2,0,1,1,1,0,0,0,0,0,0,0,0,0,0,0,0,0,0,"",1,18,1,18,3,"",2,,,,,,,"",2,0,0,0,0,1,0,0,0,0,0,"",1,,,,,,,,"",,,,,,,,,,,,,,,,,,,,,,"",,"",,,"",,,,,,,,,,,,,"",1,1,1,,"",,"",2,1,1,3,3,3,2,,2,,,,,2005,1,,,,,1,2,,,,,,,,,,,,,,,,,"",1,1,3,,,2,1,"",1,1,1,2,,,,,1,7,,7,,7,"",8,5,6,2,2,1,2,2,2,9,9,2,2,1,1,0,0,0,0,0,1,9,2,9,1,3,1,"",2,,,"",2,2,,,"",2,,,,,,,,"",,1,2,""
935529345,6,269,1,2,2,6,2,2,1,1,1,1,1,1,2,2,5,4,6,1,16,1,3,6,1,,6,2,1,4,2,2,1,,,,"",3,2,2,2,2,2,,2,0,1,0,1,0,1,0,0,0,0,0,0,0,0,0,0,0,0,"",1,15,1,20,3,"",2,,,,,,,"",2,0,0,0,0,1,0,0,0,0,0,"",1,,,,,,,,"",,,,,,,,,,,,,,,,,,,,,,"",,"",,,"",,,,,,,,,,,,,"",2,,,,"",7,"",,2,2,,,,,,,,,,,,,,,,,,,,,,,,,,,,,,,,,,,"",,,,,,,,"",,,,,,,,,,,,,,,"",,,,2,2,1,2,2,2,2,2,2,1,1,0,0,0,0,0,0,2,2,2,2,1,1,11,"PENSO ESTAR EMBARAZADA",2,,,"",9,2,,,"",2,,,,,,,,"",,2,,""
966321766,6,150,1,3,1,4,1,1,1,1,1,1,1,1,3,3,9,7,7,1,18,1,3,2,1,,4,2,2,2,1,1,,,,,"",1,1,2,2,2,2,,1,0,1,1,1,0,1,0,0,0,0,0,0,0,0,0,0,0,0,"",1,15,1,99,3,"",1,1,2,2,2,2,2,"",,,,,,,,,,,,"",,,,,,1,1,3,"",4,0,0,0,0,0,0,0,0,0,0,0,0,0,0,0,0,,1,6,1,"",9,"",2,,"",,,,,,,,,,,,,"",2,,,,"",13,"NO QUIERE",,2,1,1,1,1,2,,2,,,,,2013,2,7,,7,,2,1,0,0,1,0,0,0,0,0,0,0,0,0,0,0,0,0,"",1,3,,3,,2,2,"",2,1,2,1,5,,5,,2,,,,,,"",0,99,99,2,2,1,2,2,2,2,2,2,1,1,0,0,0,0,0,0,1,2,2,2,2,,,"",2,,,"",2,2,,,"",2,,,,,,,,"",,2,,""
741453429,6,150,1,3,1,4,1,1,1,1,1,1,1,1,3,3,9,7,7,1,40,4,1,3,2,1,4,1,,3,1,2,1,,,,"",3,1,2,2,2,2,,1,0,1,1,1,0,1,0,0,0,0,0,0,0,0,0,0,0,0,"",1,15,1,20,3,"",2,,,,,,,"",1,,,,,,,,,,,"",,99,1,1,3,2,,,"",,,,,,,,,,,,,,,,,,,,,,"",,"",,,"",,,,,,,,,,,,,"",1,1,1,,"",,"",2,2,1,8,7,7,2,,1,1,1,1,2,2006,1,,,,,1,2,,,,,,,,,,,,,,,,,"",1,1,,1,,2,1,"",1,1,2,1,1,,1,,1,36,,36,,7,"",12,6,6,1,2,1,2,2,2,2,2,2,1,1,0,0,0,0,0,0,1,2,2,2,1,3,1,"",2,,,"",1,2,,,"",2,,,,,,,,"",,1,1,""
684957248,6,156,1,3,1,1,1,1,1,1,1,1,1,1,3,2,2,6,4,1,19,1,3,6,2,1,6,2,4,4,2,2,2,,1,,"",2,2,2,2,2,2,,2,0,1,0,1,0,0,0,0,0,0,0,0,0,0,0,0,0,0,"",1,16,1,99,2,"",1,1,2,2,2,2,2,"",,,,,,,,,,,,"",,,,,,2,,,"",,,,,,,,,,,,,,,,,,,,,,"",,"",,,"",,,,,,,,,,,,,"",2,,,,"",10,"",,2,2,,,,,,,,,,,,,,,,,,,,,,,,,,,,,,,,,,,"",,,,,,,,"",,,,,,,,,,,,,,,"",,,,2,2,1,1,1,2,2,2,2,2,1,0,0,0,0,0,0,1,2,2,2,9,,,"",2,,,"",2,2,,,"",2,,,,,,,,"",,2,,""
149538235,6,70,1,4,1,4,1,1,1,1,1,1,1,1,4,3,4,4,15,2,44,4,2,2,2,1,4,1,,3,1,2,1,,,,"",3,2,2,2,2,2,,2,0,1,1,1,0,0,0,0,0,0,0,0,0,0,0,0,0,0,"",1,17,1,99,3,"",1,2,2,1,2,2,2,"",,,,,,,,,,,,"",,,,,,1,1,8,"",3,0,0,0,0,0,0,0,0,0,0,0,0,0,0,0,0,,1,6,2,"",1,"",1,1,"",,,,,,,,,,,,,"",1,1,2,,"",,"",2,1,1,2,2,2,2,,2,,,,,1994,1,,,,,1,2,,,,,,,,,,,,,,,,,"",1,1,,1,,2,1,"",2,1,1,2,,,,,1,36,,36,,5,"",5,99,6,2,2,1,2,2,2,2,2,2,2,1,1,0,0,0,0,0,1,2,2,2,2,,,"",2,,,"",2,2,,,"",2,,,,,,,,"",,1,2,""
533264548,6,70,1,4,1,4,1,1,1,1,1,1,1,1,4,3,4,4,15,2,19,1,3,6,1,,8,2,2,6,4,1,,,,,"",1,2,2,2,2,2,,2,0,1,1,1,0,1,0,0,0,0,0,0,0,0,0,0,0,0,"",1,16,1,20,3,"",1,1,2,2,2,2,2,"",,,,,,,,,,,,"",,,,,,1,1,5,"",1,0,0,0,0,0,0,0,0,0,0,0,0,0,0,0,0,,1,6,2,"",9,"",2,,"",,,,,,,,,,,,,"",1,1,1,,"",,"",2,2,2,,,,,,,,,,,,,,,,,,,,,,,,,,,,,,,,,,,"",,,,,,,,"",,,,,,,,,,,,,,,"",,,,2,1,1,1,2,2,2,2,2,2,1,0,0,0,0,0,0,2,1,9,9,2,,,"",2,,,"",2,2,,,"",2,,,,,,,,"",,1,2,""
395105660,6,454,1,4,1,4,1,1,1,1,1,1,1,1,4,3,5,6,12,2,27,2,3,6,2,1,6,1,,5,3,1,,,,,"",1,1,2,2,2,2,,1,0,1,1,1,0,0,0,0,0,0,0,0,0,0,0,0,0,0,"",1,23,1,27,1,"",1,1,2,2,2,2,2,"",,,,,,,,,,,,"",,,,,,1,1,1,"",1,0,0,1,0,0,0,0,0,0,0,0,0,0,0,0,0,,0,4,3,"",1,"",1,1,"",,,,,,,,,,,,,"",2,,,,"",3,"",,2,2,,,,,,,,,,,,,,,,,,,,,,,,,,,,,,,,,,,"",,,,,,,,"",,,,,,,,,,,,,,,"",,,,1,2,1,1,1,2,2,2,2,1,1,0,0,0,0,0,0,2,2,2,2,2,,,"",2,,,"",1,2,,,"",1,0,1,0,0,0,0,0,"",0,1,1,""
186993465,6,182,1,3,2,2,2,1,1,1,1,1,1,1,3,3,6,4,4,1,19,1,3,6,2,1,6,1,,5,3,1,,,,,"",1,2,2,2,2,2,,2,0,1,1,0,0,0,0,0,0,0,0,0,0,0,0,0,0,0,"",1,17,1,16,3,"",1,1,2,2,2,2,2,"",,,,,,,,,,,,"",,,,,,1,1,3,"",4,0,0,0,0,0,0,0,0,0,0,0,0,0,0,0,0,,1,6,1,"",1,"",2,,"",,,,,,,,,,,,,"",2,,,,"",2,"",,2,2,,,,,,,,,,,,,,,,,,,,,,,,,,,,,,,,,,,"",,,,,,,,"",,,,,,,,,,,,,,,"",,,,1,1,1,1,2,2,2,2,2,1,1,0,0,0,0,0,0,2,2,2,2,2,,,"",2,,,"",9,2,,,"",1,1,0,0,0,0,0,0,"",0,1,2,""
296228850,6,182,1,3,2,2,2,1,1,1,1,1,1,1,3,3,6,4,4,1,47,4,2,2,2,1,6,2,4,4,2,2,1,,,,"",3,2,2,2,2,2,,2,0,1,1,0,0,0,0,0,0,0,0,0,0,0,0,0,0,0,"",1,18,2,19,3,"",2,,,,,,,"",1,,,,,,,,,,,"",,19,2,,,1,1,1,"",1,0,0,0,0,0,0,0,0,0,0,0,0,0,0,0,0,,1,6,1,"",8,"",2,,"",,,,,,,,,,,,,"",1,1,2,,"",,"",1,2,1,5,5,5,2,,2,,,,,2005,3,,,,,1,2,,,,,,,,,,,,,,,,,"",1,1,3,,,2,1,"",1,1,1,2,,,,,1,24,,24,,5,"",1,3,5,1,2,1,1,2,2,2,2,2,1,1,0,0,0,0,0,0,1,2,2,2,1,3,1,"",2,,,"",2,2,,,"",2,,,,,,,,"",,1,2,""
950124614,6,71,1,3,1,4,1,1,1,1,1,1,1,1,3,3,5,4,16,3,26,2,2,1,2,1,6,1,,5,3,2,1,,,,"",3,2,2,2,2,2,,2,0,1,1,0,0,0,0,0,1,0,0,0,0,0,0,0,0,0,"",1,16,1,99,3,"",1,1,2,2,2,2,2,"",,,,,,,,,,,,"",,,,,,1,2,,"",,,,,,,,,,,,,,,,,,,,,,"",,"",,,"",0,0,0,0,0,0,0,0,0,1,0,0,"",1,1,2,,"",,"",3,2,1,4,3,3,2,,1,1,1,1,1,2010,1,,,,,1,1,1,0,0,0,0,0,0,0,0,0,0,0,0,0,0,0,"",1,1,2,,,2,2,"",1,1,1,1,99,,,99,1,12,,12,,5,"",6,0,3,1,1,1,1,2,2,1,2,2,1,1,0,0,0,0,0,0,1,2,2,2,1,1,1,"",1,3,1,"",1,1,1,1,"",1,0,0,0,1,0,0,0,"",0,1,2,""
196607739,6,451,1,2,1,4,1,1,1,1,1,1,1,1,2,1,2,2,13,2,34,3,2,1,1,,7,2,3,6,4,2,2,,1,,"",2,2,2,2,2,2,,2,0,1,1,1,1,1,0,0,1,0,0,0,1,0,0,0,0,0,"",1,20,1,24,3,"",1,1,2,2,2,2,2,"",,,,,,,,,,,,"",,,,,,1,1,1,"",1,0,0,1,0,0,0,0,0,0,0,0,0,0,0,0,0,,0,4,1,"",1,"",2,,"",,,,,,,,,,,,,"",1,1,1,,"",,"",1,2,2,,,,,,,,,,,,,,,,,,,,,,,,,,,,,,,,,,,"",,,,,,,,"",,,,,,,,,,,,,,,"",,,,1,1,1,1,1,2,2,2,2,1,1,0,0,0,0,0,0,2,2,2,2,1,2,4,"",2,,,"",2,2,,,"",1,0,1,0,0,0,0,0,"",0,1,1,""
258901867,6,50,1,3,2,4,1,1,1,1,1,2,1,1,3,2,4,4,7,1,39,3,2,1,2,1,4,1,,3,1,2,1,,,,"",3,1,2,2,2,2,,1,0,1,1,0,0,0,0,0,0,0,0,0,0,0,0,0,0,0,"",1,16,1,19,3,"",2,,,,,,,"",1,,,,,,,,,,,"",,17,1,1,1,1,1,2,"",2,0,0,0,0,0,0,0,0,0,0,0,0,0,0,0,0,,1,6,2,"",1,"",1,1,"",,,,,,,,,,,,,"",1,1,2,,"",,"",2,1,1,5,3,3,2,,1,2,1,1,1,1997,1,,,,,1,2,,,,,,,,,,,,,,,,,"",1,1,4,,,2,1,"",1,1,2,1,1,,1,,1,12,,12,,5,"",12,1,8,2,2,1,1,2,2,2,2,2,1,1,0,0,0,0,0,0,2,1,2,2,2,,,"",2,,,"",2,2,,,"",1,0,0,0,0,0,0,0,"",1,1,1,""
181974285,4,2398,1,2,2,4,1,2,1,1,1,1,3,1,2,2,6,4,9,1,34,3,1,2,2,1,6,2,4,4,2,2,1,,,,"",3,1,2,2,2,2,,1,0,1,1,1,0,1,0,0,0,0,0,0,0,0,0,0,0,0,"",1,15,2,17,3,"",2,,,,,,,"",1,,,,,,,,,,,"",,18,2,,,1,1,5,"",1,0,0,0,0,0,0,0,0,0,0,0,0,0,0,0,0,,1,6,4,"",2,"",2,,"",,,,,,,,,,,,,"",1,1,3,,"",,"",2,2,1,4,4,4,2,,2,,,,,2010,1,,,,,1,2,,,,,,,,,,,,,,,,,"",1,1,,1,,2,1,"",1,2,2,1,99,,,99,3,,,,,15,"COMPLICACION RENAL",1,3,4,2,2,1,2,1,2,2,2,2,1,1,0,1,0,0,0,0,9,9,2,2,1,2,1,"",9,,,"",9,9,,,"",1,0,1,0,0,0,0,0,"",0,1,1,""
250162968,4,1161,1,3,2,4,1,2,1,4,1,2,2,1,3,2,8,4,99,9,49,4,1,1,2,1,6,2,5,4,2,2,1,,,,"",3,2,2,2,2,2,,2,0,1,1,1,0,0,0,0,0,0,1,0,0,0,0,0,0,0,"",1,21,1,26,3,"",1,1,2,2,2,2,2,"",,,,,,,,,,,,"",,,,,,1,1,10,"",5,0,0,1,0,0,0,0,0,0,0,0,0,0,0,0,0,,0,4,1,"",1,"",1,1,"",,,,,,,,,,,,,"",1,1,4,3,"",,"",2,2,1,9,8,8,2,,1,1,1,2,2,2006,2,99,,,99,2,1,0,0,0,0,0,0,0,0,0,0,0,0,0,1,0,0,"",1,3,,3,,1,1,"",1,1,1,2,,,,,1,24,,24,,15,"COMPLICACIONES POSPARTO",99,99,6,1,1,1,1,1,2,2,2,2,1,1,0,1,0,0,0,0,1,1,1,1,2,,,"",1,3,1,"",1,2,,,"",1,0,0,0,0,0,0,0,"",1,1,1,""
9142364,4,1161,1,3,2,4,1,2,1,4,1,2,2,1,3,2,8,4,99,9,15,1,3,6,1,,5,2,2,4,2,2,1,,,,"",3,,,,,,9,9,0,1,0,1,0,1,0,0,0,0,0,0,0,0,0,0,0,0,"",2,,,,,"",,,,,,,,"",,,,,,,,,,,,"",,,,,,,,,"",,,,,,,,,,,,,,,,,,,,,,"",,"",,,"",,,,,,,,,,,,,"",2,,,,"",12,"",,2,2,,,,,,,,,,,,,,,,,,,,,,,,,,,,,,,,,,,"",,,,,,,,"",,,,,,,,,,,,,,,"",,,,1,2,1,2,1,2,2,2,1,1,1,0,1,0,0,0,0,1,1,1,1,2,,,"",2,,,"",1,2,,,"",1,0,0,0,0,0,0,0,"",1,1,1,""
41162378,4,1431,1,2,2,4,1,3,1,1,1,1,1,1,2,2,6,4,4,1,39,3,1,1,2,1,4,1,,3,1,2,1,,,,"",3,2,2,2,2,2,,2,0,0,1,0,0,0,0,0,0,0,0,0,0,0,0,0,0,0,"",1,18,1,23,3,"",2,,,,,,,"",1,,,,,,,,,,,"",,24,1,1,4,1,1,1,"",1,0,0,0,0,0,0,0,0,0,0,0,0,0,0,0,0,,1,6,1,"",6,"",1,1,"",,,,,,,,,,,,,"",2,,,,"",7,"",,2,1,5,5,5,2,,2,,,,,1998,1,,,,,1,2,,,,,,,,,,,,,,,,,"",1,3,,3,,2,1,"",1,9,9,1,99,,,99,1,1,,1,,15,"CUESTIONES DE TIEMPO, TENIA QUE ATENDER A SU OTRA HIJA ENFERMA",1,6,6,2,2,1,2,2,2,2,2,2,1,1,0,0,0,0,0,0,9,1,9,9,2,,,"",2,,,"",1,2,,,"",2,,,,,,,,"",,1,1,""
839109733,4,1261,1,3,1,4,1,2,1,1,1,1,3,1,3,2,5,4,7,1,14,1,3,6,1,,6,2,2,4,2,2,1,,,,"",3,1,2,2,2,2,,1,0,1,0,1,0,1,0,0,0,0,0,0,0,0,0,0,0,0,"",2,,,,,"",,,,,,,,"",,,,,,,,,,,,"",,,,,,,,,"",,,,,,,,,,,,,,,,,,,,,,"",,"",,,"",,,,,,,,,,,,,"",2,,,,"",7,"",,2,2,,,,,,,,,,,,,,,,,,,,,,,,,,,,,,,,,,,"",,,,,,,,"",,,,,,,,,,,,,,,"",,,,2,2,1,2,1,2,2,2,2,1,1,0,0,0,0,0,0,1,2,2,1,2,,,"",2,,,"",2,2,,,"",1,0,0,0,0,0,0,0,"",1,1,1,""
517478370,4,1261,1,3,1,4,1,2,1,1,1,1,3,1,3,2,5,4,7,1,30,3,2,1,2,1,6,2,3,4,2,2,1,,,,"",3,1,2,2,2,2,,1,0,1,0,1,0,0,0,0,0,0,0,0,0,0,0,0,0,0,"",1,16,1,17,3,"",1,1,2,2,2,2,2,"",,,,,,,,,,,,"",,,,,,1,1,1,"",1,0,0,1,0,0,0,0,0,0,0,0,0,0,0,0,0,,0,4,1,"",1,"",1,4,"",,,,,,,,,,,,,"",1,1,1,,"",,"",3,2,1,3,3,3,2,,2,,,,,2004,1,,,,,1,1,1,0,0,0,0,0,0,0,0,0,0,0,0,0,0,0,"",1,2,,2,,2,1,"",1,1,1,2,,,,,1,36,,36,,5,"",9,3,6,1,2,1,2,1,2,1,2,2,1,1,0,0,0,0,0,0,2,2,2,2,2,,,"",2,,,"",2,2,,,"",1,0,0,0,0,0,0,1,"QUISTES EN EL OVARIO",0,1,1,""
618022609,1,3619,3,4,2,1,1,1,1,1,1,1,1,1,4,2,3,4,16,3,30,3,3,6,2,1,8,1,,7,4,1,,,,,"",1,2,2,1,2,2,,1,0,1,1,1,0,0,0,0,1,0,0,1,0,0,0,0,0,0,"",1,19,1,19,3,"",1,1,2,2,2,2,2,"",,,,,,,,,,,,"",,,,,,1,1,3,"",4,0,0,0,0,0,0,0,0,0,0,0,0,0,0,0,0,,1,6,3,"",10,"NO QUIERE TOMAR NADA",2,,"",,,,,,,,,,,,,"",1,1,1,,"",,"",4,1,2,,,,,,,,,,,,,,,,,,,,,,,,,,,,,,,,,,,"",,,,,,,,"",,,,,,,,,,,,,,,"",,,,2,1,1,1,2,1,2,2,2,1,1,0,0,0,0,0,0,2,2,2,2,1,1,4,"",2,,,"",2,2,,,"",1,0,0,0,0,0,1,0,"",0,2,,""
667794076,1,3575,3,3,1,8,1,1,1,1,1,1,1,1,3,2,2,6,99,9,21,2,3,6,1,,7,2,2,6,4,1,,,,,"",1,2,2,1,2,2,,1,0,1,1,1,0,0,0,0,0,0,0,0,0,0,0,0,0,0,"",1,16,1,17,3,"",1,1,2,2,2,2,2,"",,,,,,,,,,,,"",,,,,,1,1,1,"",1,0,0,1,0,0,0,0,0,0,0,0,0,0,0,0,0,,0,4,1,"",6,"",1,4,"",,,,,,,,,,,,,"",1,1,2,,"",,"",4,2,2,,,,,,,,,,,,,,,,,,,,,,,,,,,,,,,,,,,"",,,,,,,,"",,,,,,,,,,,,,,,"",,,,1,1,1,1,2,1,2,1,2,1,1,0,0,0,0,0,0,2,2,2,1,1,2,10,"",1,2,10,"",9,9,,,"",1,1,1,0,0,0,0,0,"",0,1,1,""
998135583,1,6646,3,2,1,2,1,1,1,1,1,1,1,1,2,2,2,6,9,1,37,3,1,3,1,,7,2,3,6,4,1,,,,,"",1,2,2,2,2,2,,2,0,1,1,1,0,0,0,0,0,0,0,0,0,0,0,0,0,0,"",1,19,1,21,3,"",1,1,2,2,2,2,2,"",,,,,,,,,,,,"",,,,,,1,1,3,"",4,0,0,0,0,0,0,0,0,0,0,0,0,0,0,0,0,,1,6,1,"",1,"",2,,"",,,,,,,,,,,,,"",1,1,1,,"",,"",2,1,1,1,1,1,2,,2,,,,,2002,1,,,,,1,2,,,,,,,,,,,,,,,,,"",1,1,4,,,2,3,"",1,2,2,1,99,,,99,1,18,,18,,7,"",6,6,6,1,1,1,1,1,2,2,2,1,1,1,0,0,0,0,0,0,2,2,2,2,1,3,1,"",2,,,"",2,2,,,"",1,0,1,0,0,0,0,0,"",0,1,1,""
614898942,1,4568,3,2,1,1,1,1,1,1,1,1,1,1,2,2,2,8,16,3,28,2,5,6,1,,8,2,7,6,4,2,2,,1,,"",2,2,2,2,2,2,,2,0,1,1,1,0,0,0,0,0,0,1,0,0,0,0,0,0,0,"",1,20,1,20,1,"",1,1,2,2,2,2,2,"",,,,,,,,,,,,"",,,,,,2,,,"",,,,,,,,,,,,,,,,,,,,,,"",,"",,,"",,,,,,,,,,,,,"",1,1,1,,"",,"",4,2,2,,,,,,,,,,,,,,,,,,,,,,,,,,,,,,,,,,,"",,,,,,,,"",,,,,,,,,,,,,,,"",,,,1,1,1,1,1,1,1,1,1,1,0,0,1,0,0,0,0,2,2,2,2,2,,,"",2,,,"",9,2,,,"",1,1,1,0,0,0,0,0,"",0,1,1,""
523926448,1,7338,3,2,1,1,1,1,1,1,1,1,1,1,2,2,2,6,99,9,47,4,1,3,1,,8,2,4,6,4,1,,,,,"",1,1,2,2,2,2,,1,0,1,0,1,1,0,0,0,0,0,0,0,0,0,0,0,0,0,"",1,14,2,17,3,"",2,,,,,,,"",1,,,,,,,,,,,"",,16,2,,,1,2,,"",,,,,,,,,,,,,,,,,,,,,,"",,"",,,"",0,0,0,0,0,0,0,0,0,0,0,1,"ES UNA RELACION DE CONFIANZA",1,1,1,,"",,"",3,1,1,2,2,2,2,,2,,,,,1998,1,,,,,1,1,0,0,1,0,0,0,0,0,0,0,0,0,0,0,0,0,"",1,2,8,,,2,3,"",1,2,2,2,,,,,1,5,,5,,2,"",0,99,6,1,1,1,1,2,2,2,2,2,1,1,0,0,0,0,0,0,2,2,2,2,1,2,4,"",1,3,4,"",2,2,,,"",1,0,0,0,0,0,0,0,"",1,1,6,"PRACTICA MEDITACION"
235613373,1,17038,1,3,1,1,1,1,1,1,1,1,1,1,3,2,2,8,13,2,33,3,1,6,1,,8,2,6,6,4,1,,,,,"",1,1,2,2,2,2,,1,0,1,1,1,0,0,0,0,0,0,0,0,0,0,0,0,0,0,"",1,17,1,18,3,"",1,1,2,2,2,2,2,"",,,,,,,,,,,,"",,,,,,1,1,1,"",1,0,0,0,0,0,0,0,0,0,0,0,0,0,0,0,0,,1,6,2,"",1,"",1,4,"",,,,,,,,,,,,,"",1,1,2,,"",,"",3,2,2,,,,,,,,,,,,,,,,,,,,,,,,,,,,,,,,,,,"",,,,,,,,"",,,,,,,,,,,,,,,"",,,,1,1,1,1,1,2,1,2,2,1,1,0,0,0,0,0,0,2,2,2,2,1,2,4,"",2,,,"",2,2,,,"",1,1,1,0,0,0,0,0,"",0,2,,""
228902643,2,6375,1,3,1,3,1,1,1,1,1,1,1,1,3,2,3,3,99,9,44,4,2,2,2,1,8,1,,7,4,1,,,,,"",1,1,2,2,1,2,,1,0,1,1,1,0,0,0,0,0,0,0,0,1,0,0,0,0,0,"",1,18,1,99,3,"",1,1,2,2,2,2,2,"",,,,,,,,,,,,"",,,,,,1,2,,"",,,,,,,,,,,,,,,,,,,,,,"",,"",,,"",0,0,0,0,0,0,0,0,0,0,1,0,"",1,1,1,,"",,"",3,1,2,,,,,,,,,,,,,,,,,,,,,,,,,,,,,,,,,,,"",,,,,,,,"",,,,,,,,,,,,,,,"",,,,1,1,1,1,1,2,1,1,2,1,1,1,0,0,0,0,0,2,2,2,2,1,3,7,"",2,,,"",1,2,,,"",1,0,0,0,0,0,0,0,"",1,2,,""
706535423,2,21534,1,5,1,4,1,2,1,1,1,1,1,1,5,3,2,8,99,9,31,3,5,6,2,1,8,2,1,6,4,1,,,,,"",1,2,2,2,2,2,,2,0,1,1,1,0,1,0,0,0,0,0,0,0,0,0,0,0,0,"",1,16,1,18,3,"",1,1,2,2,2,2,2,"",,,,,,,,,,,,"",,,,,,1,1,1,"",1,0,0,0,0,0,0,0,0,0,0,0,0,0,0,0,0,,1,6,2,"",9,"",2,,"",,,,,,,,,,,,,"",1,1,3,,"",,"",1,2,1,1,0,,2,,1,1,1,2,2,,,,,,,,,,,,,,,,,,,,,,,,,"",,,,,,,,"",,,,,,,,,,,,,,,"",,,,1,2,1,1,2,2,2,2,2,1,1,0,0,0,0,0,0,2,2,2,2,2,,,"",2,,,"",2,2,,,"",2,,,,,,,,"",,1,1,""
720633972,2,15770,1,3,1,4,1,1,1,1,1,1,1,1,3,2,4,4,14,2,41,4,1,2,2,1,6,1,,5,3,1,,,,,"",1,1,2,2,2,2,,1,0,1,0,1,0,0,0,0,0,0,0,0,0,0,0,0,0,0,"",1,17,1,19,1,"",2,,,,,,,"",1,,,,,,,,,,,"",,17,2,,,1,1,3,"",4,0,0,0,0,0,0,0,0,0,0,0,0,0,0,0,0,,1,6,1,"",2,"",2,,"",,,,,,,,,,,,,"",1,1,1,,"",,"",3,1,1,2,2,2,2,,2,,,,,1996,1,,,,,1,2,,,,,,,,,,,,,,,,,"",1,2,8,,,2,2,"",1,2,2,2,,,,,1,1,,1,,11,"",1,2,6,1,2,1,1,2,2,2,2,2,1,1,0,0,0,0,0,0,2,1,2,2,1,1,4,"",1,1,4,"",2,2,,,"",1,0,0,0,0,0,0,1,"INFECCIONES",0,1,1,""
912591557,2,3541,1,3,1,1,1,1,1,1,1,1,1,1,3,2,2,6,8,1,39,3,1,6,2,1,7,1,,7,4,1,,,,,"",1,1,2,2,2,2,,1,0,1,1,1,1,1,0,0,0,0,1,1,1,0,0,1,0,0,"",1,21,1,26,3,"",1,1,2,2,2,2,2,"",,,,,,,,,,,,"",,,,,,1,1,1,"",1,0,0,1,0,0,0,0,0,0,0,0,0,0,0,0,0,,0,4,2,"",10,"POR COSTUMBRE",1,4,"",,,,,,,,,,,,,"",1,1,1,,"",,"",3,1,1,1,1,1,2,,2,,,,,2006,1,,,,,1,2,,,,,,,,,,,,,,,,,"",1,2,,2,,2,2,"",1,1,2,2,,,,,1,15,,15,,12,"",12,6,6,1,1,1,1,1,2,2,2,1,1,0,0,1,0,0,0,0,2,2,2,2,1,2,11,"CURIOSIDAD",9,,,"",2,2,,,"",1,0,0,0,0,0,0,0,"",1,1,1,""
182223821,2,1656,3,2,1,2,1,1,1,1,1,1,1,1,2,1,2,2,16,3,27,2,2,1,1,,7,2,4,6,4,2,1,,,,"",3,2,2,2,2,2,,2,0,1,1,1,1,1,0,0,1,0,0,0,0,0,0,0,0,0,"",1,18,1,18,4,"",1,1,2,2,2,2,2,"",,,,,,,,,,,,"",,,,,,1,1,1,"",1,0,0,0,0,0,0,0,0,0,0,0,0,0,0,0,0,,1,6,1,"",6,"",1,2,"",,,,,,,,,,,,,"",1,1,3,,"",,"",1,2,2,,,,,,,,,,,,,,,,,,,,,,,,,,,,,,,,,,,"",,,,,,,,"",,,,,,,,,,,,,,,"",,,,1,1,1,1,2,2,2,2,2,1,1,0,0,0,0,0,0,2,2,2,2,1,2,4,"",1,2,4,"",2,2,,,"",1,0,0,0,0,0,0,0,"",1,1,2,""
389505410,2,1640,1,3,1,4,1,1,1,1,1,1,1,1,3,2,4,4,6,1,40,4,2,2,2,1,4,2,2,2,1,2,2,,1,,"",2,2,2,2,2,2,,2,0,1,1,1,0,1,1,0,1,0,0,0,0,0,0,0,0,0,"",1,17,1,22,4,"",2,,,,,,,"",1,,,,,,,,,,,"",,20,1,1,1,1,1,1,"",1,0,0,0,0,0,0,0,0,0,0,0,0,0,0,0,0,,1,6,2,"",1,"",1,1,"",,,,,,,,,,,,,"",1,1,2,,"",,"",2,1,1,3,3,3,2,,2,,,,,2005,1,,,,,1,2,,,,,,,,,,,,,,,,,"",1,2,,2,,1,1,"",1,1,2,2,,,,,1,36,,36,,5,"",36,4,4,2,2,1,2,2,2,2,2,2,1,1,0,0,0,0,0,0,1,1,1,1,2,,,"",1,3,4,"",1,2,,,"",1,0,0,0,0,0,0,0,"",1,1,2,""
363184643,1,4012,1,3,1,1,1,1,1,1,1,1,1,1,3,2,4,4,99,9,40,4,2,2,2,1,6,1,,5,3,2,1,,,,"",3,1,2,2,2,2,,1,0,1,1,1,0,0,0,0,0,0,0,0,0,0,0,0,0,0,"",1,18,1,20,3,"",1,1,2,2,2,2,2,"",,,,,,,,,,,,"",,,,,,1,1,3,"",4,0,0,0,0,0,0,0,0,0,0,0,0,0,0,0,0,,1,6,1,"",1,"",2,,"",,,,,,,,,,,,,"",1,1,2,,"",,"",3,2,1,2,2,2,2,,2,,,,,2001,1,,,,,1,2,,,,,,,,,,,,,,,,,"",1,2,,2,,2,2,"",1,2,2,2,,,,,1,4,,4,,1,"",4,4,6,1,1,1,1,2,2,1,2,2,1,1,0,0,0,0,0,0,2,2,2,2,1,3,1,"",2,,,"",9,2,,,"",1,0,1,0,0,0,0,0,"",0,1,1,""
918806363,1,2859,3,2,1,1,1,1,1,1,1,1,1,1,2,2,2,2,99,9,34,3,2,2,2,1,7,1,,7,4,1,,,,,"",1,1,2,2,2,2,,1,0,1,0,1,0,0,0,0,0,0,0,0,0,0,0,0,0,0,"",1,20,1,22,3,"",1,1,2,2,2,2,2,"",,,,,,,,,,,,"",,,,,,1,2,,"",,,,,,,,,,,,,,,,,,,,,,"",,"",,,"",1,0,0,0,0,0,0,0,0,0,0,0,"",1,1,4,9,"EMBARAZO",,"",3,2,1,1,1,1,2,,2,,,,,2012,1,,,,,1,2,,,,,,,,,,,,,,,,,"",1,2,8,,,2,2,"",1,9,2,1,0,2,,,2,,,,,,"",99,5,6,1,1,1,1,1,1,1,1,1,1,1,0,0,0,0,0,0,2,2,2,2,1,2,7,"",1,2,7,"",1,1,1,7,"",1,0,1,0,0,0,0,0,"",0,2,,""
229585398,1,3389,1,2,1,4,1,1,1,1,1,1,1,1,2,1,4,4,9,1,24,2,2,1,2,1,6,1,,5,3,2,1,,,,"",3,2,2,2,2,2,,2,0,1,1,1,0,1,0,0,0,0,0,0,0,0,0,0,0,0,"",1,15,1,17,3,"",1,1,2,2,2,2,2,"",,,,,,,,,,,,"",,,,,,1,1,1,"",1,0,0,1,0,0,0,0,0,0,0,0,0,0,0,0,0,,0,4,2,"",1,"",2,,"",,,,,,,,,,,,,"",1,1,3,,"",,"",3,2,1,2,2,2,2,,2,,,,,2010,2,3,,3,,2,2,,,,,,,,,,,,,,,,,"",1,4,,4,,2,2,"",9,2,2,1,6,,6,,1,20,,20,,5,"",12,3,6,1,2,1,1,1,2,2,2,2,1,1,0,0,0,0,0,0,9,2,2,2,1,2,1,"",1,2,1,"",1,1,2,1,"",2,,,,,,,,"",,1,1,""
31777330,1,6727,1,3,1,3,1,1,1,1,1,1,2,1,3,2,4,4,15,2,21,2,3,6,1,,8,2,3,6,4,1,,,,,"",1,1,2,1,1,2,,1,0,1,1,1,0,0,0,0,0,0,0,0,0,0,0,0,1,0,"",1,17,1,18,3,"",1,1,2,2,2,2,2,"",,,,,,,,,,,,"",,,,,,1,1,3,"",4,0,0,0,0,0,0,0,0,0,0,0,0,0,0,0,0,,1,6,1,"",1,"",2,,"",,,,,,,,,,,,,"",1,2,1,,"",,"",3,2,2,,,,,,,,,,,,,,,,,,,,,,,,,,,,,,,,,,,"",,,,,,,,"",,,,,,,,,,,,,,,"",,,,1,2,1,1,1,2,2,2,2,1,1,1,0,1,0,0,0,9,9,2,1,2,,,"",2,,,"",1,2,,,"",1,0,0,0,0,0,0,0,"",1,2,,""
520018592,1,2951,1,4,2,2,2,1,1,1,1,1,1,1,4,3,3,6,14,2,26,2,3,6,1,,8,2,7,6,4,1,,,,,"",1,1,2,2,2,2,,1,0,1,1,1,1,0,0,0,0,0,0,0,0,0,0,0,0,0,"",1,99,1,99,3,"",1,1,2,2,2,2,2,"",,,,,,,,,,,,"",,,,,,2,,,"",,,,,,,,,,,,,,,,,,,,,,"",,"",,,"",,,,,,,,,,,,,"",1,1,2,,"",,"",3,2,2,,,,,,,,,,,,,,,,,,,,,,,,,,,,,,,,,,,"",,,,,,,,"",,,,,,,,,,,,,,,"",,,,1,1,1,1,1,2,1,2,2,1,1,0,0,0,0,0,0,2,2,2,1,1,1,4,"",1,1,4,"",1,2,,,"",1,0,0,0,0,0,0,0,"",1,1,1,""
422984620,1,15674,1,3,1,4,1,1,1,1,1,1,1,1,3,2,3,4,1,1,14,1,3,6,1,,6,2,2,4,2,2,1,,,,"",3,2,2,2,2,2,,2,0,1,0,1,0,0,0,0,0,0,0,0,0,0,0,0,0,0,"",2,,,,,"",,,,,,,,"",,,,,,,,,,,,"",,,,,,,,,"",,,,,,,,,,,,,,,,,,,,,,"",,"",,,"",,,,,,,,,,,,,"",2,,,,"",7,"",,2,2,,,,,,,,,,,,,,,,,,,,,,,,,,,,,,,,,,,"",,,,,,,,"",,,,,,,,,,,,,,,"",,,,2,2,1,2,2,2,2,2,2,1,1,0,0,0,0,0,0,2,2,2,1,2,,,"",2,,,"",1,2,,,"",1,0,0,0,0,0,0,0,"",1,2,,""
647647404,1,15674,1,3,1,4,1,1,1,1,1,1,1,1,3,2,3,4,1,1,44,4,1,1,2,1,6,1,,5,3,2,1,,,,"",3,2,2,2,2,2,,2,0,1,0,1,0,0,0,0,0,0,0,0,0,0,0,0,0,0,"",1,17,1,20,3,"",1,1,2,2,2,2,2,"",,,,,,,,,,,,"",,,,,,1,2,,"",,,,,,,,,,,,,,,,,,,,,,"",,"",,,"",0,0,0,0,0,0,0,1,0,0,0,0,"",1,1,2,,"",,"",1,1,1,1,1,1,2,,2,,,,,1999,1,,,,,1,1,1,0,0,0,0,0,0,0,0,0,0,0,0,0,0,0,"",1,6,,6,,2,2,"",1,2,2,2,,,,,1,6,,6,,4,"",2,2,3,1,2,1,1,1,2,2,1,1,1,1,0,0,0,0,0,0,1,2,2,2,1,2,4,"",2,,,"",2,2,,,"",1,0,1,0,0,0,0,0,"",0,2,,""