"IDENTIFI","PONDERACION","REGION","POB_URB","PRVNC","AGL_URB","BHCV01","BHCV02","BHCV03","BHCV04","BHCV05","BHCV06","BHCV07","BHCV08","BHCV09","BHCV10","BHCV11","BHHO01","BHHO02","BHHO03","CANT_COMPONENTES","MYRS18","BHIH01_01","RANGO_INGRESO","IMPUTADO","ITF_UC_QUINTILES","TIPO_H","NBI_1","NBI_2","NBI_3","NBI_4","NBI_T","DISC_HOG","BHCH04_J","BHCH05_J","RANGEDAD_J","BHCH07_J","NIVINSTR_J","NIVINSTR_AG_J","COB_SALUD_J","C_ACT_J","C_OCU_J","BHSL12","BHSL13","BHCH03","BHCH04","BHCH05","RANGEDAD","BHCH07","NIVINSTR","NIVINSTR_AG","COB_SALUD","C_ACT","C_OCU","BISL12","BISL13","BISG01","BISG02","BISG03","BISG04","BISG05","BISG06","BISG07","BIAF01","BIAF02","BIAF03","BIAF04","BIAF05","BIAF06","BIAF07","BIAF08","BIAF09_01","BIAF09_02","BIAF09_03","BIAF09_04","BIAF10_01","BIAF10_02","BIAF10_03","BIAF10_04","BIAF10_05","BIAF10_06","BIAF10_07","BIAF10_08","BIAF10_09","BIAF10_10","BIAF10_11","BIAF10_12","BIAF10_13","BIAF10_14","BIAF10_15","BIAF10_16","BIAF10_17","BIAF10_18","BIAF11","BIAF12","BIAF13","BIAF14","BIAF15","BIAF16","BIAF17","BIAF18","BIAF19","BIAF20_01","BIAF20_02","BIAF20_03","BIAF20_04","BIAF20_05","BIAF20_06","BIAF20_07","BIAF20_08","BIAF20_09","BIAF20_10","BIAF20_11","BIAF20_12","BIAF20_13","BIAF20_14","BIAF20_15","BIAF20_16","BIAF20_17","BIAF20_18","NIV_AF","BIAM01_01","BIAM01_02","BIAM01_03","BIAM01_04","BIAM02","BIAM03","BIAM04","BITA01","BITA02","BITA03","BITA04","BITA05","BITA06","BITA07","BITA08","BITA09_01","BITA09_02","BITA09_03","BITA10","BITA11","BITA12","BITA13","BITA14_01","BITA14_02","BITA14_03","BITA14_04","BITA14_05","BITA14_06","PRV_V_TA","CON_TA","PRV_P_TA_14A","BIHA01","BIHA02","BIHA03","BIHA04","BIHA05_01","BIHA05_02","PRV_HA","CON_HA","BIPC01","BIPC02","BIPC03","BIPC04","BIPC05","BIPC06","PC_AGR","BIAL01","BIAL02","BIAL03","BIAL04","BIAL05","BIAL06","PROMEDIO_FV_DIARIO","FRUYVER","BICO01","BICO02","BICO03","BICO04","BICO05_01","BICO05_02","PRV_COL","CON_COL","BICA01","BICA02","BICA03","BICA04_01","BICA04_02","BICA04_03","BICA04_04","BICA05_01","BICA05_02","BICA05_03","BICA05_04","BICA06","C_REG","ABU_S_C","ABU_S_V","ABU_S_W","AB_H_S","AB_NH_S","AB_TC_S","ABU_P_C","ABU_P_V","ABU_P_W","AB_H_P","AB_NH_P","AB_TC_P","BIDI01","BIDI02","BIDI03","BIDI04_01","BIDI04_02","BIDI05","PRV_DIA","CON_DIA","BIPP01","BIPP02","BIPP03","BIPP04","BIPP05","BIPP06_01","BIPP06_02","BIPP06_03","BIPP06_04","BIPP06_05","BIPP06_06","BIPP06_07","C_MAM","C_PAP","BILE01","BILE02","BILE03","BILE04","BILE05","BILE06"
10001442025,1679,2,2,6,6,1,2,1,4,1,1,1,2,1,1,2,1,2,1,2,2,1400,8,0,3,2,0,0,0,0,0,0,1,70,6,2,3,2,3,3,,,,1,1,70,6,2,3,2,3,3,,,,4,1,1,1,1,1,90,8,,8,,8,,99,2,,,,,,,,,,,,,,,,,,,,,,,,,,,,,1,1,1,,,,,,,,,,1,,,,,,,,,3,1,1,2,2,,,,2,,,,,,,,,,,,,,2,2,2,9,9,2,2,2,3,2,1,1,2,1,1,2,1,1,1,1,,1,75,164,2,1,1,7,2,6,1,"2,85714285714286",2,1,1,1,2,,,1,1,1,1,28,"888","2","888",2,"888","888","888",2,2,2,2,2,2,2,2,2,2,2,2,2,2,2,1,,1,1,2,1,1,1,,,,,3,,,,,,,,,,4,1,2,2,2,2
10006798412,836,1,1,2,1,1,4,1,2,1,1,1,1,1,1,1,1,4,1,1,1,3000,11,1,5,1,0,0,0,0,0,0,2,62,5,3,6,3,3,1,3,1,2,1,2,62,5,3,6,3,3,1,3,1,2,2,3,1,3,1,2,80,8,,8,,8,,240,1,1,2,1,2,,,,,,,,,,,,,,,,,,,,,,,,1,,,,1,,,,,,,,,,,,,,,,,,3,1,1,1,2,,,,1,21,1,3,,,,1,10,,,,,,2,1,2,2,2,2,2,1,2,1,1,1,3,,,,2,1,1,1,,1,76,165,2,1,1,4,3,7,1,"2,71428571428571",2,1,1,2,,,,2,1,1,2,," "," "," ",," "," "," ",,,2,2,2,2,2,2,2,2,2,2,2,2,2,2,,,,,1,2,1,1,1,1,1,2,1,2,2,2,2,2,2,1,1,4,1,2,2,2,2
10008006434,146,6,3,94,8,1,5,1,4,1,1,1,1,1,1,1,1,5,3,4,4,6000,14,0,5,4,0,0,0,0,0,0,1,59,5,2,5,3,3,1,3,2,,1,1,59,5,2,5,3,3,1,3,2,,3,1,1,1,1,1,80,8,,8,,3,180,240,,2,2,1,2,,,,,,,,,,,,,,,,,,,,,,,,2,,,,,,,,,,,,,,,,,,,,,,3,1,1,2,1,,,,2,,,,,,,,,,,,,,2,2,2,9,2,2,9,2,3,2,1,2,3,,,,2,1,2,,1,1,70,170,1,2,1,7,1,7,1,"2",2,1,1,2,,,,2,1,1,1,4,"888","2","888",2,"888","888","888",2,3,2,2,2,2,2,2,2,2,2,2,2,2,2,2,,,,,1,2,1,,,,,2,1,2,1,2,2,2,2,,,4,1,2,2,2,2
10008361051,297,4,3,54,8,1,2,1,6,1,2,1,1,1,1,1,1,2,1,2,2,1500,8,1,3,2,0,0,0,0,0,1,1,53,5,2,3,2,3,1,3,2,,2,2,52,5,2,3,2,3,3,,,,3,1,1,1,2,3,70,8,,8,,8,,180,2,,,,,,,,,,,,,,,,,,,,,,,,,,,,,2,9,2,,,,,,,,,,,,,,,,,,,3,2,2,2,2,2,,,2,,,,,,,,,,,,,,2,1,9,9,9,1,9,2,3,1,1,1,2,2,,,1,1,1,2,2,1,65,999,9,1,1,7,3,7,1,"4",2,2,,2,,,,,2,1,1,1,"888","1","888",2,"888","888","888",2,2,2,2,2,2,2,2,2,2,2,2,2,2,2,2,,,,,1,2,1,1,1,1,1,2,1,2,2,2,2,2,2,1,1,4,1,2,2,2,2
10008693448,1146,2,2,14,2,1,4,1,2,1,2,1,1,1,1,2,1,4,3,7,2,2000,10,0,2,4,0,0,0,0,0,0,1,40,4,2,3,2,4,1,3,2,,1,1,40,4,2,3,2,4,1,3,2,,3,1,1,1,1,1,90,8,,8,,7,105,240,,1,1,1,2,,,,,,,,,,,,,,,,,,,,,,,,1,,,,,,,,,,,,,1,,,,,,,,,3,2,2,2,2,2,,,1,15,1,3,,,,1,19,,,,,,2,2,2,1,1,2,1,1,2,1,1,1,1,2,,,1,1,2,,2,1,74,170,2,1,1,2,2,7,1,"1,57142857142857",2,1,2,2,,,,2,1,1,1,2,"888","3","888",2,"888","12","888",2,2,2,2,1,2,2,1,1,2,1,2,2,1,1,1,,2,,,1,1,1,,,,,3,,,,,,,,,,4,1,2,2,2,2
10011493116,1585,1,4,6,1,1,4,2,1,1,2,1,2,1,1,2,1,4,2,7,2,800,4,0,1,4,0,0,0,0,0,0,2,34,3,2,4,2,8,2,,,,1,2,34,3,2,4,2,8,2,,,,1,1,1,1,1,1,80,8,,8,,8,,60,2,,,,,,,,,,,,,,,,,,,,,,,,,,,,,2,1,2,,,,,,,,,,,,,,,,,,,3,2,2,2,2,1,1,4,2,,,,,,,,,,,,,,2,2,2,2,2,2,2,2,3,2,1,1,2,1,1,2,1,1,2,,2,3,95,150,3,1,1,2,1,7,2,"2,28571428571429",2,2,,2,,,,,2,2,,," "," "," ",," "," "," ",,,2,2,2,2,2,2,2,2,2,2,2,2,2,2,,,,,1,2,1,1,2,1,1,2,2,2,2,1,2,2,2,1,1,4,1,2,1,2,2
10016715844,1818,1,4,6,1,1,4,1,3,1,1,1,1,1,1,1,1,4,2,2,2,5000,13,0,5,8,0,0,0,0,0,0,2,45,4,6,4,2,3,1,3,2,,1,2,45,4,6,4,2,3,1,3,2,,1,1,1,1,1,1,100,8,,8,,8,,99,2,,,,,,,,,,,,,,,,,,,,,,,,,,,,,1,1,2,,,,,,,,,,,,,,,,,,,3,2,2,2,2,2,,,1,11,1,1,,,20,,,,,2,,,1,1,1,9,1,1,9,1,1,,1,1,3,,,,2,1,2,,1,1,57,157,1,2,1,1,1,7,1,"1,14285714285714",2,1,2,2,,,,2,1,1,1,8,"888","2","888",2,"888","888","888",2,2,2,2,2,2,2,2,2,2,2,2,2,2,2,2,,,,,2,2,1,1,1,1,1,2,1,2,1,2,2,2,2,1,1,4,2,2,2,2,2
10020849018,92,3,3,10,8,1,3,1,2,1,2,1,1,1,1,1,1,3,1,2,2,2600,11,0,4,2,0,0,0,0,0,0,1,59,5,2,3,2,2,1,3,3,,2,2,54,5,2,3,2,4,1,2,1,1,3,1,1,1,1,1,100,8,,8,,1,60,90,,2,2,2,1,1,,,,,,,,,,,,,,,,,,,4,,1,2,1,,,,,,,,1,,,,,,,,,,,,,,3,1,2,2,2,,,,2,,,,,,,,,,,,,,2,2,2,9,9,2,9,2,3,2,1,1,2,1,1,2,1,1,1,1,,1,76,999,9,2,1,7,2,7,1,"3",2,1,1,2,,,,2,1,2,,," "," "," ",," "," "," ",,,2,2,2,2,2,2,2,2,2,2,2,2,2,2,,,,,1,2,1,1,1,1,1,3,,,,,,,,1,1,4,4,2,2,2,2
10021509341,81,4,3,34,8,1,1,3,4,2,3,2,1,1,3,3,1,1,1,1,1,500,2,0,1,1,0,0,1,0,1,1,1,79,6,3,3,2,3,3,,,,1,1,79,6,3,3,2,3,3,,,,4,2,1,1,2,1,80,8,,8,,8,,360,2,,,,,,,,,,,,,,,,,,,,,,,,,,,,,1,5,2,,,,,,,,,,,,,,,,,,,3,1,2,2,1,,,,1,16,1,3,,,,1,33,,,,,,2,2,9,9,9,2,2,1,2,2,2,,3,,,,,2,2,,2,1,77,172,2,1,1,7,2,7,1,"3",2,2,,2,,,,,2,1,1,28,"888","1","888",2,"888","888","888",2,2,2,2,2,2,2,2,2,2,2,2,2,2,2,2,,,,,4,2,2,,,,,3,,,,,,,,,,4,4,2,2,2,2
10021668577,1785,2,3,6,8,1,3,1,4,1,1,1,1,1,1,1,1,3,3,7,4,1400,8,1,1,4,0,0,0,0,0,0,1,43,4,2,5,3,9,1,3,2,,2,2,45,4,2,5,3,9,1,2,1,2,3,1,1,1,1,1,80,8,,8,,8,,120,2,,,,,,,,,,,,,,,,,,,,,,,,,,,,,2,1,2,,,,,,,,,,,,,,,,,,,3,2,2,2,2,2,,,2,,,,,,,,,,,,,,2,2,2,9,9,9,1,2,3,1,1,3,3,,,,2,2,2,,2,1,54,160,1,1,1,7,99,7,2," ",9,2,,2,,,,,2,2,,," "," "," ",," "," "," ",,,2,2,2,2,2,2,2,2,2,2,2,2,2,2,,,,,4,2,2,2,,2,,2,2,1,2,2,2,2,2,2,2,4,2,2,2,2,2
10028321977,280,6,4,62,8,1,2,1,4,1,1,1,1,1,1,1,1,2,2,3,3,300,1,0,1,6,0,0,0,0,0,1,2,60,5,3,2,1,8,3,,,,1,2,60,5,3,2,1,8,3,,,,4,2,1,1,2,1,40,8,,8,,8,,360,2,,,,,,,,,,,,,,,,,,,,,,,,,,,,,2,9,2,,,,,,,,,,,,,,,,,,,3,1,2,2,2,,,,1,11,1,1,,,15,,,,,2,,,1,1,2,2,2,2,2,1,1,,1,1,2,1,1,2,1,1,2,,2,1,75,180,1,1,1,2,0,3,2,",857142857142857",2,1,1,1,1,1,2,1,1,2,,," "," "," ",," "," "," ",,,2,2,2,2,2,2,2,2,2,2,2,2,2,1,2,1,1,2,1,1,1,1,9,1,9,4,,,,,,,,9,9,4,1,2,2,1,2
10028460985,217,3,3,38,8,3,3,1,1,2,1,1,1,1,1,1,1,3,2,3,2,2200,11,0,3,6,0,0,0,0,0,1,2,40,4,3,7,3,3,1,3,2,,3,1,18,2,6,4,2,3,3,,,,2,1,1,1,1,1,90,3,180,8,,6,360,360,,2,1,1,2,,,,,,,,,,,,,,,,,,,,,,,,1,,,,,,,,,,,1,,,1,,,,,,,,2,2,1,2,2,,,,2,,,,,,,,,,,,,,2,2,2,2,1,9,2,2,3,1,2,,3,,,,,2,2,,2,1,58,170,1,2,1,4,4,6,5,"6,57142857142857",1,2,,2,,,,,2,2,,," "," "," ",," "," "," ",,,2,2,2,2,2,2,2,2,2,2,2,2,2,2,,,,,4,2,2,,,,,4,,,,,,,,,,4,2,2,2,2,2
10029525514,529,3,2,90,5,1,4,2,4,2,1,1,1,1,1,2,1,4,3,6,3,2800,11,0,3,4,0,0,0,0,0,1,1,54,5,2,3,2,3,1,3,2,,1,1,54,5,2,3,2,3,1,3,2,,3,1,1,1,1,1,80,5,750,5,750,8,,60,,1,1,1,2,,,,,,,,,,,,,,,,,,,,,,,,2,,,,,,,,,,,,,,,,,,,,,,1,2,2,2,2,2,,,1,13,1,3,,,,1,25,,,,,,2,2,2,9,9,9,9,1,2,2,2,,3,,,,,2,2,,2,3,70,172,1,1,1,1,2,1,1,",428571428571429",2,1,3,1,2,,,1,2,1,1,4,"3","3","888",2,"6","6","888",2,2,2,1,1,2,1,1,1,2,1,2,2,1,1,2,,,,,1,2,1,,,,,3,,,,,,,,,,3,1,2,2,2,2
10035815214,481,5,3,70,8,1,3,1,1,1,1,1,1,1,1,1,1,3,2,4,3,4000,12,0,4,4,0,0,0,0,0,0,1,57,5,2,5,3,4,1,3,1,1,2,2,56,5,2,5,3,4,3,,,,3,1,1,1,1,2,50,8,,8,,7,63,420,,1,2,2,2,,,,,,,,,,,,,,,,,,,,,,,,1,,,,,,,,,,,,,,,,,,,,,1,3,2,2,2,2,2,,,2,,,,,,,,,,,,,,1,1,9,9,9,9,9,2,3,1,1,1,1,1,1,2,1,1,2,,2,1,75,160,2,2,1,4,1,4,2,"1,71428571428571",2,1,1,1,1,2,1,1,1,1,1,16,"888","1","888",2,"1","888","888",2,2,2,2,2,2,2,2,2,2,2,2,2,2,2,2,,,,,1,2,1,1,1,1,1,3,,,,,,,,1,1,4,2,2,2,2,2
10041074265,467,3,3,38,8,1,5,2,4,2,2,1,1,1,1,1,1,5,3,5,5,1200,7,0,1,4,0,0,0,0,0,1,1,52,5,2,1,1,8,2,,,,3,2,29,3,6,6,3,3,1,3,1,1,3,1,1,1,2,1,70,8,,8,,8,,480,1,2,2,2,2,,,,,,,,,,,,,,,,,,,,,,,,1,,,,,,,,1,,,,,,,,,,,,,,3,1,1,2,1,,,,2,,,,,,,,,,,,,,1,2,1,1,9,2,1,2,3,1,1,1,1,2,,,1,1,1,2,1,1,54,158,1,3,1,3,1,2,1,",714285714285714",2,2,,2,,,,,2,1,2,," "," "," ",," "," "," ",,,2,2,2,2,2,2,2,2,2,2,2,2,2,2,,,,,1,2,1,2,,1,1,2,1,1,2,2,2,2,2,2,1,3,3,2,2,1,2
10043334646,137,4,4,54,8,1,2,1,4,1,2,1,1,1,1,3,1,2,1,1,1,1000,6,0,3,1,0,0,0,0,0,0,1,55,5,5,3,2,3,3,,,,1,1,55,5,5,3,2,3,3,,,,3,1,1,1,1,1,80,8,,8,,8,,240,2,,,,,,,,,,,,,,,,,,,,,,,,,,,,,1,8,2,,,,,,,,,,,,,,,,,,,3,1,2,1,1,,,,1,18,1,3,,,,2,18,,,,,,2,2,9,9,9,9,9,1,2,2,1,1,3,,,,2,1,2,,2,2,76,172,2,2,1,6,1,7,1,"1,85714285714286",2,1,1,2,,,,2,1,1,1,4,"3","888","888",2,"888","888","888",2,2,2,2,2,2,2,2,2,2,2,2,2,2,2,2,,,,,4,2,2,,,,,2,1,2,2,2,2,2,2,,,4,1,2,2,2,2
10055016448,558,3,2,90,5,1,5,1,4,1,1,1,1,1,1,2,1,5,2,3,2,3500,12,0,4,4,0,0,0,0,0,0,1,31,3,2,7,3,1,1,1,3,,2,2,33,3,2,7,3,1,1,1,1,1,2,1,1,1,1,1,80,8,,8,,7,210,360,,1,2,1,1,1,,,,,,,,,,,,,,,,,,,4,,5,5,1,,,,,,,,1,,,,,,,,,,,,,,2,1,2,2,2,,,,2,,,,,,,,,,,,,,2,2,2,9,2,2,9,2,3,2,1,1,3,,,,2,1,2,,2,1,50,160,1,1,1,3,1,7,1,"1,42857142857143",2,1,1,2,,,,2,1,1,1,4,"1","1","888",2,"888","888","888",2,2,2,2,2,2,2,2,2,2,2,2,2,2,2,2,,,,,1,2,1,1,2,1,1,1,1,1,2,2,2,2,1,1,1,4,1,1,2,2,2
10057324618,3250,1,1,2,1,3,3,1,1,1,1,1,1,1,1,1,1,3,2,3,3,3000,11,0,4,4,0,0,0,0,0,1,1,73,6,1,3,2,3,3,,,,2,2,63,5,1,6,3,4,3,,,,3,1,1,2,2,1,85,8,,8,,7,210,360,,1,1,2,2,,,,,,,,,,,,,,,,,,,,,,,,1,,,,,,,,1,,,,,,,,,,,,,,2,1,1,2,2,,,,1,30,1,3,,,,2,20,,,,,,2,2,9,9,2,2,2,1,2,2,1,1,3,,,,2,1,1,1,,1,82,162,3,3,1,7,1,7,1,"2",2,1,1,2,,,,2,1,1,2,," "," "," ",," "," "," ",,,2,2,2,2,2,2,2,2,2,2,2,2,2,1,2,1,1,1,1,1,1,1,1,1,1,3,,,,,,,,1,1,4,1,2,2,2,2
10058710544,613,4,4,18,8,1,5,1,3,1,1,1,1,1,1,1,1,5,2,3,3,6000,14,2,5,4,0,0,0,0,0,0,1,56,5,2,7,3,1,1,3,2,,1,1,56,5,2,7,3,1,1,3,2,,2,1,1,1,1,1,80,8,,8,,3,360,120,,1,1,1,2,,,,,,,,,,,,,,,,,,,,,,,,2,,,,,,,,,,,,,,,,,,,,,,3,2,2,2,2,2,,,2,,,,,,,,,,,,,,1,2,1,1,9,2,1,2,3,1,1,1,3,,,,2,1,2,,2,2,90,175,2,2,1,7,1,7,1,"2",2,2,,1,2,,,,2,2,,," "," "," ",," "," "," ",,,2,2,2,2,2,2,2,2,2,2,2,2,2,2,,,,,1,2,1,,,,,3,,,,,,,,,,4,1,2,2,2,2
10059139758,564,3,3,66,8,1,5,2,5,2,2,1,1,1,1,1,1,5,3,6,3,1500,8,1,2,5,0,0,0,0,0,1,1,66,6,2,3,2,3,3,,,,2,2,64,5,2,5,3,3,3,,,,2,1,1,1,1,1,80,8,,8,,7,210,120,,2,2,1,2,,,,,,,,,,,,,,,,,,,,,,,,2,,,,,,,,,,,,,,,,,,,,,,2,2,2,2,2,2,,,1,99,1,1,,,2,,,,,2,,,1,1,9,9,9,9,9,1,1,,1,1,3,,,,2,1,2,,2,1,67,160,2,1,1,2,2,2,2,"1,14285714285714",2,1,1,2,,,,2,1,1,2,," "," "," ",," "," "," ",,,2,2,2,2,2,2,2,2,2,2,2,2,2,2,,,,,2,2,1,1,2,1,2,3,,,,,,,,1,1,4,3,2,2,2,2
10062998179,1474,2,4,6,8,1,3,1,4,1,1,1,1,1,1,1,1,3,2,2,2,1700,9,0,3,2,0,0,0,0,0,0,1,69,6,2,4,2,3,1,2,2,,1,1,69,6,2,4,2,3,1,2,2,,3,1,1,1,2,1,80,8,,4,240,6,720,180,,1,1,1,1,1,,1,,,,,,,,,,,,,,,,3,4,,5,2,2,,,,,,,,,,,,,,,,,,,,,,1,1,1,2,2,,,,1,16,1,3,,,,1,,2,,,,,1,2,1,2,1,2,2,1,2,1,1,1,2,1,1,2,1,1,1,1,,1,90,170,3,2,1,3,2,3,2,"1,71428571428571",2,1,2,1,1,2,1,1,1,1,1,16,"888","1","888",2,"888","888","888",2,2,2,2,2,2,2,2,2,2,2,2,2,2,2,2,,,,,2,2,1,,,,,3,,,,,,,,,,1,1,2,2,2,2
10069527631,339,4,4,22,8,1,4,1,4,1,2,1,2,1,1,2,1,4,3,4,2,5000,13,0,5,4,0,0,0,0,0,0,1,42,4,2,7,3,3,1,2,3,,2,2,37,4,2,7,3,3,1,3,2,,2,1,1,1,1,1,85,8,,8,,8,,480,2,,,,,,,,,,,,,,,,,,,,,,,,,,,,,1,1,1,1,,,,1,,,,,,,,,,,,,,3,2,2,2,2,2,,,2,,,,,,,,,,,,,,2,2,2,9,9,9,9,2,3,2,1,1,3,,,,2,1,2,,2,1,65,157,2,1,1,7,1,3,1,"1,42857142857143",2,1,1,2,,,,2,1,1,1,4,"1","888","888",2,"888","888","888",2,2,2,2,2,2,2,2,2,2,2,2,2,2,2,2,,,,,1,2,1,1,1,1,1,2,1,2,2,2,2,2,2,1,1,4,1,2,2,2,2
10071115972,156,3,3,10,8,1,3,1,2,1,2,1,1,1,1,2,1,3,2,3,3,1000,6,0,1,4,0,0,0,0,0,0,1,63,5,2,3,2,3,3,,,,1,1,63,5,2,3,2,3,3,,,,4,1,1,1,2,2,70,8,,8,,8,,240,1,1,2,1,2,,,,,,,,,,,,,,,,,,,,,,,,2,,,,,,,,,,,,,,,,,,,,,,3,2,2,2,2,1,1,3,1,14,1,3,,,,2,40,,,,,,2,2,9,9,9,2,2,1,2,2,1,2,3,,,,2,1,2,,2,1,83,175,2,2,1,3,3,3,2,"2,14285714285714",2,1,3,2,,,,2,2,1,1,8,"4","888","888",2,"888","888","888",2,2,2,2,2,2,2,2,2,2,2,2,2,2,2,2,,,,,4,2,2,,,,,3,,,,,,,,,,4,1,2,2,2,2
10073145107,1201,2,2,14,2,1,4,1,1,1,1,1,1,1,1,1,1,4,2,4,2,3000,11,1,4,4,0,0,0,0,0,0,1,41,4,2,5,3,3,1,3,2,,1,1,41,4,2,5,3,3,1,3,2,,1,1,1,1,1,1,95,8,,8,,8,,480,2,,,,,,,,,,,,,,,,,,,,,,,,,,,,,1,9,1,,,,,,,,,,,,,,,,,,1,3,2,2,2,2,2,,,1,14,1,3,,,,1,22,,,,,,2,2,1,2,1,9,9,1,2,1,1,1,1,2,,,1,1,2,,2,1,102,170,3,3,1,0,,0,,"0",2,2,,2,,,,,2,1,1,28,"9","2","2",2,"30","888","888",2,1,1,1,2,2,1,1,1,1,2,2,1,1,1,2,,,,,4,2,2,,,,,2,2,2,1,2,2,2,2,,,1,1,2,2,1,1
10078052651,1308,1,1,2,1,3,2,1,9,1,1,1,1,1,1,1,1,2,1,1,1,5000,13,0,5,1,0,0,0,0,0,0,1,20,2,6,6,3,3,3,,,,1,1,20,2,6,6,3,3,3,,,,3,1,1,1,1,1,75,4,960,8,,1,15,480,,2,2,1,1,1,,1,1,1,,,,,,,,,,,,,,5,3,,5,2,1,,,,,,,,,,,,1,,,,,,,,,,1,1,2,2,2,,,,2,,,,,,,,,,,,,,1,1,9,2,1,2,2,2,3,1,1,1,3,,,,2,1,2,,1,1,79,182,1,3,1,3,3,5,6,"5,57142857142857",1,1,3,2,,,,2,2,1,1,6,"9","888","1,5",2,"12","888","2",2,1,1,1,2,2,1,1,1,1,2,2,1,1,1,2,,,,,3,2,1,,,,,2,2,1,1,2,2,1,2,,,3,1,2,2,2,1
10082489774,77,4,3,34,8,1,3,1,1,2,2,1,1,1,1,1,1,3,2,4,1,600,2,0,1,6,0,0,0,0,0,0,2,34,3,3,3,2,9,1,2,2,,1,2,34,3,3,3,2,9,1,2,2,,4,1,1,1,2,1,60,8,,8,,5,50,60,,2,1,1,1,1,,1,,,,,,,,,,,,,,,,1,7,,5,5,2,,,,,,,,,,,,,,,,,,,,,,3,2,2,2,2,2,,,1,12,1,3,,,,1,7,,,,,,2,2,2,2,2,2,2,1,2,2,2,,3,,,,,2,2,,2,9,999,170,9,3,1,9,99,9,99," ",9,2,,2,,,,,2,2,,," "," "," ",," "," "," ",,,2,2,2,2,2,2,2,2,2,2,2,2,2,2,,,,,4,2,2,2,,1,1,2,2,2,1,2,2,2,2,2,1,1,4,2,2,2,2
10083376964,232,5,4,74,8,1,6,1,1,1,1,1,1,1,1,1,1,6,3,3,3,5000,13,0,5,6,0,0,0,0,0,1,2,83,6,5,3,2,3,3,,,,1,2,83,6,5,3,2,3,3,,,,4,2,2,2,2,2,60,8,,8,,8,,540,2,,,,,,,,,,,,,,,,,,,,,,,,,,,,,2,10,2,,,,,,,,,,,,,,,,,,,3,1,2,1,1,,,,2,,,,,,,,,,,,,,2,2,2,2,2,2,2,2,3,2,1,1,3,,,,2,1,1,2,2,1,75,150,3,3,1,6,1,7,2,"2,85714285714286",2,1,1,2,,,,2,1,2,,," "," "," ",," "," "," ",,,2,2,2,2,2,2,2,2,2,2,2,2,2,2,,,,,1,2,1,1,4,1,4,4,,,,,,,,2,2,4,2,2,2,2,2
10086690870,97,6,4,58,8,1,2,1,4,1,1,1,1,1,1,1,1,2,1,2,1,4000,12,0,5,8,0,0,0,0,0,0,2,68,6,4,3,2,3,3,,,,1,2,68,6,4,3,2,3,3,,,,3,1,1,1,1,1,60,8,,8,,8,,180,1,2,2,2,1,1,,,,,,,,,,,,,,,,,,,4,,1,2,2,,,,,,,,,,,,,,,,,,,,,,3,1,2,2,1,,,,2,,,,,,,,,,,,,,2,2,9,2,9,2,9,2,3,2,1,1,3,,,,2,1,2,,2,1,69,165,2,1,1,7,2,3,1,"2,42857142857143",2,1,1,1,1,1,1,1,1,2,,," "," "," ",," "," "," ",,,2,2,2,2,2,2,2,2,2,2,2,2,2,2,,,,,1,2,1,1,4,1,4,4,,,,,,,,2,2,4,2,2,2,2,2
10088033489,154,3,4,46,8,1,3,2,2,1,2,1,1,1,1,3,1,3,2,3,3,1000,6,0,1,4,0,0,0,0,0,1,1,58,5,1,3,2,8,1,3,1,1,3,2,18,2,6,6,3,8,3,,,,1,1,1,1,1,1,90,1,60,3,360,5,100,270,,1,2,1,1,,,,,,,,1,,,,,,,,,,,,2,,2,4,2,,,,,,,,,,,,,,,,,,,,,,2,2,2,2,2,2,,,1,15,2,3,,,,2,3,,,,,,1,1,2,1,2,2,2,1,3,1,2,,3,,,,,2,2,,1,1,53,174,1,1,1,3,1,7,1,"1,42857142857143",2,2,,2,,,,,2,1,2,," "," "," ",," "," "," ",,,2,2,2,2,2,2,2,2,2,2,2,2,2,2,,,,,4,2,2,2,,2,,2,2,1,2,2,2,2,2,2,2,4,4,2,2,2,2
10092478936,1480,2,4,6,8,3,3,1,3,1,1,1,1,1,1,1,1,3,2,3,3,7000,14,1,5,4,0,0,0,0,0,0,1,43,4,1,4,2,9,1,2,1,2,2,2,44,4,1,5,3,2,1,3,3,,2,1,1,1,1,1,100,5,600,8,,6,180,420,,2,1,1,1,,1,1,1,1,,,,,,,,1,,,,,,13,3,,4,1,2,,,,,,,,,,,,,,,,,,,,,,1,1,2,1,2,,,,1,35,1,1,,,1,,,,,1,1,99,1,1,2,9,2,2,9,1,1,,1,1,3,,,,2,1,2,,2,1,57,162,1,1,1,7,2,7,2,"4",2,1,1,1,2,,,1,1,1,1,4,"1","888","888",2,"888","888","888",2,2,2,2,2,2,2,2,2,2,2,2,2,2,2,2,,,,,1,2,1,1,1,1,1,2,2,2,2,2,2,1,2,1,1,1,2,2,2,2,2
10092929823,118,6,3,62,8,3,5,1,5,1,1,1,1,1,1,1,1,5,1,1,1,1100,7,0,3,1,0,0,0,0,0,1,1,72,6,5,7,3,3,3,,,,1,1,72,6,5,7,3,3,3,,,,2,1,1,1,1,1,80,8,,8,,7,150,360,,2,2,1,2,,,,,,,,,,,,,,,,,,,,,,,,2,,,,,,,,,,,,,,,,,,,,,,3,2,2,2,2,2,,,2,,,,,,,,,,,,,,2,2,9,2,9,9,2,2,3,2,1,1,3,,,,2,1,2,,2,1,81,172,2,2,1,7,1,7,2,"3",2,1,1,2,,,,2,1,2,,," "," "," ",," "," "," ",,,2,2,2,2,2,2,2,2,2,2,2,2,2,1,,1,1,1,1,1,1,,,,,2,1,2,2,2,2,2,2,,,4,1,2,1,2,2
10095154575,1150,5,2,50,4,1,5,1,2,1,1,1,1,1,1,1,2,3,3,5,3,800,4,0,1,5,0,0,0,0,0,0,1,53,5,2,4,2,8,2,,,,3,2,19,2,6,4,2,8,2,,,,3,1,1,1,1,1,90,8,,8,,5,90,720,,2,2,1,2,,,,,,,,,,,,,,,,,,,,,,,,2,,,,,,,,,,,,,,,,,,,,,,3,1,2,2,2,,,,1,18,9,1,,,4,,,,,2,,,1,1,9,1,1,2,9,1,3,1,1,2,3,,,,2,1,2,,2,1,46,163,1,1,1,7,2,0,,"2",2,2,,2,,,,,2,1,1,1,"2","888","888",2,"888","888","888",2,2,2,2,2,2,2,2,2,2,2,2,2,2,2,2,,,,,2,2,1,2,,2,,2,1,2,2,2,2,2,2,2,2,1,4,2,2,2,2
10097667926,758,5,2,50,4,1,3,1,1,1,1,1,1,1,1,1,1,3,1,2,2,4000,12,0,5,2,0,0,0,0,0,0,1,63,5,1,5,3,1,1,3,2,,2,2,57,5,1,5,3,3,1,1,3,,3,1,1,1,1,1,70,8,,8,,2,120,180,,1,1,1,1,1,,,,,,,,,,,,,,,,,,,4,,2,2,2,,,,,,,,,,,,,,,,,,,,,,3,1,2,2,2,,,,2,,,,,,,,,,,,,,2,2,2,2,2,2,2,2,3,2,1,1,3,,,,2,1,1,1,,1,67,163,2,2,1,7,2,7,2,"4",2,1,1,2,,,,2,1,1,1,3,"888","1","888",2,"888","888","888",2,2,2,2,2,2,2,2,2,2,2,2,2,2,2,1,2,2,,,2,1,1,1,1,1,1,2,1,2,2,2,2,2,2,1,1,4,1,2,2,2,2
10099746416,181,3,3,38,8,3,3,1,2,1,1,1,1,1,1,1,1,3,2,4,2,4000,12,0,4,4,0,0,0,0,0,0,1,48,4,2,7,3,3,1,3,1,2,1,1,48,4,2,7,3,3,1,3,1,2,2,1,1,1,1,1,70,8,,8,,7,420,120,,1,2,1,2,,,,,,,,,,,,,,,,,,,,,,,,1,,,,,1,,,1,,,,,1,,,,,,,,,2,2,1,2,2,,,,1,20,2,2,1,3,,,,,,2,,,2,2,2,2,9,2,9,1,3,2,1,1,3,,,,2,1,2,,2,1,71,170,1,2,1,4,1,4,2,"1,71428571428571",2,1,1,1,1,1,1,1,1,1,2,," "," "," ",," "," "," ",,,2,2,2,2,2,2,2,2,2,2,2,2,2,2,,,,,1,2,1,,,,,2,2,1,2,2,2,2,2,,,4,3,2,2,2,2
10100498798,496,3,4,38,8,1,5,1,2,2,1,1,1,1,1,1,1,5,3,7,5,1400,8,0,1,5,0,0,0,0,0,1,1,57,5,2,3,2,8,1,2,2,,1,1,57,5,2,3,2,8,1,2,2,,4,1,1,2,3,1,65,8,,8,,8,,600,2,,,,,,,,,,,,,,,,,,,,,,,,,,,,,2,9,2,,,,,,,,,,,,,,,,,,,3,1,2,2,2,,,,2,,,,,,,,,,,,,,2,2,2,9,9,2,9,2,3,2,1,1,2,1,1,1,1,1,1,1,,1,80,170,2,1,4,4,4,6,1,"3,14285714285714",2,1,1,1,1,1,1,1,1,1,2,," "," "," ",," "," "," ",,,2,2,2,2,2,2,2,2,2,2,2,2,2,1,,1,1,1,1,1,1,,,,,3,,,,,,,,,,4,1,2,2,2,1
10104129570,182,3,4,38,8,1,3,2,2,2,2,1,1,1,1,1,1,3,2,3,2,500,2,1,1,4,0,0,0,0,0,1,1,45,4,2,2,1,8,1,3,2,,2,2,45,4,2,3,2,8,1,3,1,1,4,2,1,2,2,3,50,8,,7,600,7,840,60,,1,1,1,2,,,,,,,,,,,,,,,,,,,,,,,,2,,,,,,,,,,,,,,,,,,,,,,1,1,2,2,2,,,,2,,,,,,,,,,,,,,1,1,1,1,9,1,1,2,3,1,1,1,3,,,,2,1,1,1,,1,71,150,3,2,4,3,2,7,1,"1,85714285714286",2,1,1,1,1,1,1,1,1,2,,," "," "," ",," "," "," ",,,2,2,2,2,2,2,2,2,2,2,2,2,2,1,2,1,1,2,1,1,1,1,1,1,1,3,,,,,,,,1,1,4,1,2,1,1,2
10104573674,228,6,4,62,8,1,3,1,5,1,1,1,1,1,1,3,1,3,1,2,2,4000,12,0,5,2,0,0,0,0,0,0,1,30,3,2,7,3,3,1,3,2,,2,2,34,3,2,7,3,3,1,3,2,,3,1,1,1,1,1,100,8,,2,180,3,180,480,,2,2,2,1,1,,,,1,,,,,,,,,,,,,,1,4,,4,4,1,,,,,,,,,,,,,,,,1,,,,,,2,1,2,2,2,,,,2,,,,,,,,,,,,,,1,2,1,1,1,9,2,2,3,1,1,1,3,,,,2,1,2,,2,1,63,157,2,3,1,5,1,7,1,"1,71428571428571",2,1,1,2,,,,2,1,1,1,4,"1","888","888",2,"888","888","888",2,2,2,2,2,2,2,2,2,2,2,2,2,2,2,2,,,,,1,2,1,1,3,1,3,2,2,2,1,2,2,2,2,2,2,4,2,2,2,2,2
10115589258,1354,5,2,50,4,1,4,1,1,2,2,1,1,1,1,1,1,4,3,7,4,600,2,0,1,5,0,0,0,0,0,1,2,49,4,2,3,2,8,1,3,1,1,2,1,46,4,2,4,2,8,1,3,2,,5,2,2,1,2,2,51,8,,8,,7,210,240,,2,1,1,2,,,,,,,,,,,,,,,,,,,,,,,,2,,,,,,,,,,,,,,,,,,,,,,2,2,2,2,2,1,2,5,1,14,1,1,,,2,,,,,2,,,1,1,1,9,9,9,1,1,1,,1,9,2,2,,,1,9,1,2,2,1,140,170,3,3,1,1,1,0,,",142857142857143",2,2,,1,2,,,,2,1,1,8,"888","1","888",2,"888","888","888",2,2,2,2,2,2,2,2,2,2,2,2,2,2,2,1,,2,,,9,1,9,,,,,4,,,,,,,,,,4,4,2,1,1,1
10118695747,934,3,3,66,8,1,3,2,2,2,1,1,1,1,1,1,1,3,2,7,5,1800,10,1,2,5,0,0,0,0,0,1,1,40,4,1,4,2,8,1,2,2,,9,1,28,3,1,5,3,8,1,2,2,,3,1,1,1,1,1,70,8,,6,360,4,90,60,,2,1,1,2,,,,,,,,,,,,,,,,,,,,,,,,1,,,,,,,,,,,1,,,,,,,,,,,2,2,2,2,2,2,,,1,20,2,3,,,,2,1,,,,,,2,2,1,2,1,2,9,1,3,1,1,1,2,1,2,1,1,1,2,,1,1,75,165,2,2,1,7,3,3,1,"3,42857142857143",2,1,1,1,2,,,1,1,1,1,4,"3","3","888",2,"888","888","888",2,3,2,2,2,2,1,2,1,2,2,2,2,2,2,2,,,,,4,2,2,,,,,1,1,2,2,2,2,2,2,,,3,1,2,2,2,2
10126300703,122,6,4,26,8,1,2,1,2,2,1,1,1,1,1,1,1,2,1,1,1,1500,8,0,4,1,0,0,0,0,0,1,2,73,6,4,7,3,3,3,,,,1,2,73,6,4,7,3,3,3,,,,5,3,1,2,3,1,30,8,,5,50,8,,300,,1,2,2,1,,,,,1,,,,,,,,,,,,,,,6,,5,2,1,,,,,,,,,,,,,,,,1,,,,,,3,1,2,2,1,,,,1,20,1,3,,,,1,40,,,,,,2,2,9,9,9,2,9,1,2,2,1,1,2,1,1,2,1,1,2,,2,1,60,167,1,2,1,0,,6,1,",857142857142857",2,1,1,1,1,2,1,1,1,1,1,8,"1","1","888",2,"888","888","888",2,3,2,2,2,2,2,2,2,2,2,2,2,2,2,2,,,,,1,2,1,2,,1,4,4,,,,,,,,2,2,4,4,2,2,2,2
10129871637,536,4,4,54,8,1,4,2,4,1,2,1,1,1,1,2,1,4,1,2,2,1500,8,0,3,2,0,0,0,0,0,0,1,52,5,2,3,2,3,1,3,2,,2,2,48,4,2,2,1,3,1,2,1,1,4,2,1,1,2,3,50,8,,8,,5,300,360,,1,1,1,2,,,,,,,,,,,,,,,,,,,,,,,,2,,,,,,,,,,,,,,,,,,,,,,2,2,2,2,2,2,,,1,99,1,1,,,5,,,,,1,1,99,1,1,1,9,2,2,9,1,1,,1,1,2,1,1,1,1,1,1,1,,2,80,999,9,2,1,4,2,3,3,"2,42857142857143",2,1,3,1,2,,,1,2,1,1,1,"888","888","1",2,"888","888","888",2,3,2,2,2,2,2,2,2,2,2,2,2,2,2,2,,,,,4,2,2,2,,1,4,3,,,,,,,,2,2,4,1,2,2,2,2
10132814833,726,3,4,66,8,1,4,1,4,1,2,1,1,1,1,1,1,4,3,5,4,1800,10,0,2,4,0,0,0,0,0,0,1,45,4,2,5,3,3,1,3,1,1,1,1,45,4,2,5,3,3,1,3,1,1,1,1,1,1,1,1,100,3,180,8,,8,,480,,2,2,2,1,,,,,,,,,,1,,,,,,,,,,4,,4,4,2,,,,,,,,,,,,,,,,,,,,,,2,2,2,2,2,2,,,1,22,1,3,,,,1,10,,,,,,2,2,2,9,1,2,1,1,2,1,1,3,2,2,,,1,2,2,,1,1,87,172,2,1,1,3,1,6,1,"1,28571428571429",2,1,3,1,2,,,1,2,1,1,28,"888","1","888",2,"888","888","888",2,2,2,2,2,2,2,2,2,2,2,2,2,2,2,2,,,,,3,2,1,,,,,1,1,2,2,2,2,1,2,,,3,1,1,2,2,2
10133332043,417,3,3,10,8,1,4,2,2,2,2,1,1,1,1,1,1,4,4,7,6,2000,10,0,2,5,0,0,0,0,0,0,1,60,5,1,4,2,8,1,3,3,,3,1,29,3,6,3,2,8,1,2,3,,3,1,1,1,1,2,80,8,,8,,8,,120,1,1,2,1,1,,,,,,,,,,1,,,,,,,,,,3,,2,2,2,,,,,,,,,,,,,,,,,,,,,,3,2,2,2,2,2,,,1,20,1,1,,,20,,,,,1,1,2,1,1,1,2,1,2,1,1,1,,2,,3,,,,,2,2,,2,1,69,190,1,1,1,2,4,6,1,"2",2,2,,2,,,,,2,1,1,1,"9","888","888",2,"888","888","888",2,1,2,1,2,2,1,2,1,1,2,2,1,2,1,2,,,,,3,2,1,,,,,2,2,2,1,2,2,2,2,,,1,2,2,2,2,2
10134427325,706,2,4,82,8,1,3,1,1,1,2,1,2,1,1,2,1,3,1,2,2,3500,12,0,5,2,0,0,0,0,0,0,1,56,5,2,3,2,3,3,,,,2,2,61,5,2,5,3,3,3,,,,3,1,1,1,1,1,50,8,,8,,4,240,240,,1,2,2,1,1,,,,,,,,,,,,,,,,,,,4,,5,2,2,,,,,,,,,,,,,,,,,,,,,,3,2,2,2,2,2,,,2,,,,,,,,,,,,,,2,2,2,9,9,9,9,2,3,2,1,1,2,1,1,1,1,1,2,,1,1,75,154,3,1,1,5,1,5,1,"1,42857142857143",2,1,1,1,1,1,1,1,1,1,3,," "," "," ",," "," "," ",,,2,2,2,2,2,2,2,2,2,2,2,2,2,2,,,,,1,2,1,1,4,1,4,3,,,,,,,,2,2,4,2,2,2,2,2
10135416108,136,5,4,74,8,1,1,1,2,1,2,2,1,1,3,3,2,1,1,4,2,600,2,0,1,4,0,1,1,0,2,0,2,24,2,1,5,3,3,1,3,2,,1,2,24,2,1,5,3,3,1,3,2,,4,1,1,1,2,1,60,8,,3,60,3,90,240,,1,1,1,1,1,,1,,,,,,,,,,,,,,,,3,4,,4,3,2,,,,,,,,,,,,,,,,,,,,,,3,1,1,2,1,,,,1,18,2,3,,,,2,4,,,,,,1,2,2,1,1,2,1,1,3,1,1,1,2,1,1,2,1,1,2,,1,1,50,158,1,3,1,5,4,3,2,"3,71428571428571",2,1,1,2,,,,2,1,1,2,," "," "," ",," "," "," ",,,2,2,2,2,2,2,2,2,2,2,2,2,2,2,,,,,1,2,1,2,,1,1,1,1,2,2,2,2,2,1,2,1,3,2,2,2,2,2
10142507960,396,3,4,90,8,1,3,2,4,2,2,1,2,1,1,1,1,3,2,4,2,1400,8,0,2,4,0,0,0,0,0,0,1,39,4,1,3,2,3,1,3,3,,2,2,38,4,1,3,2,3,1,2,1,1,3,1,1,1,1,1,100,8,,2,240,3,120,260,,1,1,1,1,,,,,1,,,,,,,,,,,,,,,3,,5,4,2,,,,,,,,,,,,,,,,,,,,,,2,1,2,2,2,,,,1,18,1,2,3,1,,,,,,1,1,99,2,2,2,2,2,2,2,1,1,,1,1,3,,,,2,1,2,,2,1,77,180,1,1,1,2,2,6,1,"1,42857142857143",2,1,1,2,,,,2,1,1,1,4,"3","888","888",2,"888","888","888",2,2,2,2,2,2,2,2,2,2,2,2,2,2,2,2,,,,,1,2,1,2,,1,1,2,2,2,2,2,2,2,1,2,1,3,4,2,2,2,2
10144302799,76,6,3,94,8,1,3,1,4,1,1,1,1,1,1,1,1,3,2,4,2,7000,14,0,5,4,0,0,0,0,0,0,1,29,3,1,6,3,3,1,3,3,,2,2,31,3,1,5,3,3,1,3,3,,2,1,1,1,1,1,80,8,,8,,3,90,600,,1,2,1,1,1,,,,,,,,,,,,,,,,,,,4,,4,5,2,,,,,,,,,,,,,,,,,,,,,,3,1,2,2,2,,,,2,,,,,,,,,,,,,,2,2,2,2,9,2,9,2,3,2,1,1,1,2,,,1,1,2,,2,1,64,165,1,3,1,7,1,5,1,"1,71428571428571",2,2,,2,,,,,2,2,,," "," "," ",," "," "," ",,,2,2,2,2,2,2,2,2,2,2,2,2,2,2,,,,,1,2,1,2,,1,1,2,1,2,2,2,2,2,2,2,1,4,2,2,2,2,2