"IDENTIFI","PROV","REGION","PONDERACION","CHCV01","CHCV02","CHCV03","CHCV04","CHCV05","CHCV06","CHCV07","CHCV08","CHCV09","CHCV10","CHCV11","MYRS18","CANT_COMPONENTES","BHIH01_01","RANGO_INGRESO","IMPUTADO","ITF_UC_QUINTILES","TIPO_H","NBI_1","NBI_2","NBI_3","NBI_4","NBI_TOT","CHCH04_J","CHCH05_J","RAEDAD_J","CHCH07_J","NIVINS_J","CS_J","C_ACT_J","C_OCU_J","CHCH03","CHCH04","CHCH05","RANGEDAD","CHCH07","NIVINSTR","CS","C_ACT","C_OCU","CISL08","CISG01","CISG02","CISG03","CISG04","CISG05","CISG06","CISG07","CIAF01","CIAF02_M","CIAF03","CIAF04_M","CIAF05","CIAF06_M","CIAF07_M","CIAM01_1","CIAM01_2","CIAM01_3","CIAM01_4","CIAM02","CIAM03","CIAM04","AT_MED","CITA01","CITA02","CITA03","CITA04","CITA05","CITA06","CITA07","CITA08","CITA09","CITA10","CITA11_1","CITA11_2","CITA11_3","CITA11_4","PRV_V_TA","PRV_P_TA","CONSUMO_TABACO_100","ET_PROCH","CIHA01","CIHA02","CIHA03","CIHA04","CIHA05","HA_ANIO","CIPC01","CIPC02","CIPC03","CIPC04","CIPC05","CIPC06","PC_AGR","CIAL01","CIAL02","CIAL03_1","CIAL03_2","CIAL03_3","CIAL03_4","CIAL03_5","CIAL03_6","CIAL03_7","FRUYVER_5_DIAS","CICO01","CICO02","CICO03","CICO04","CICO05","CICA01","CICA02_1","CICA02_2","CICA0311","CICA0321","CICA0331","CICA0411","CICA0421","CICA0431","CICA05","AB_TC_P","AB_TC_S","AB_H_P","AB_H_S","AB_NH_P","ABU_P_C","ABU_P_V","ABU_P_W","ABU_S_C","ABU_S_V","ABU_S_W","C_REG","C_EPI","CIDI01","CIDI02","CIDI03","CIDI04","CIDI05","CIPP01","CIPP02","CIPP03","CIPP04","CIPP05","CIPP06_1","CIPP06_2","CIPP06_3","CIPP06_4","CIPP06_5","CIPP06_6","CIPP06_7","CIPA01","CIPA02","CIPA03","CIPA04","CIPA05","CIPA06"
66160320,66,3,114,4,1,1,2,2,2,1,1,1,1,2,2,2,,0,0,,8,1,0,0,0,1,2,24,2,6,6,8,3,,5,2,18,2,6,6,8,2,,,4,1,1,1,2,1,80,3,360,0,,5,600,240,1,2,2,2,,,,1,1,15,2,3,,3,,,2,,,,,,1,2,3,6,1,1,1,2,,1,2,,1,1,52,160,1,3,1,8,7,7,2,7,1,7,1,2,,2,,,2,,," "," "," "," "," "," ",,,,,,,,,,,,,2,2,2,,,,1,2,,1,1,4,,,,,,,,3,1,2,2,2,2
66014318,66,3,539,1,2,2,1,1,1,1,1,1,1,1,5,5,,0,0,,4,0,0,0,0,0,1,61,5,2,4,8,2,,1,1,61,5,2,4,8,2,,,3,1,1,1,1,1,90,0,,7,1260,7,420,120,2,2,2,2,2,,,2,2,,,,,,,,2,,,,,,2,2,3,6,1,3,3,,,2,2,,2,1,65,174,1,3,1,7,2,7,4,8,8,1,3,1,3,2,,,2,,," "," "," "," "," "," ",,,,,,,,,,,,,2,2,2,,,,3,,,,,3,,,,,,,,3,1,2,2,2,2
14003066,14,2,938,1,2,2,1,1,1,1,1,1,1,1,4,4,,0,0,,4,0,0,0,0,0,1,50,5,2,5,3,3,,3,1,22,2,6,6,3,1,3,1,2,1,1,1,1,1,90,0,,3,240,2,60,360,2,2,2,2,2,,,2,2,,,,,,,,1,7,2,1,2,1,2,1,3,6,2,,3,,,2,2,,2,3,999,999,9,1,1,1,2,5,7,7,8,3,3,2,,2,,,2,,," "," "," "," "," "," ",,,,,,,,,,,,,2,2,2,,,,4,,,,,2,1,2,2,2,2,2,2,2,2,2,2,2,2
66005368,66,3,210,1,3,2,2,2,1,1,1,1,1,1,2,2,,0,0,,2,0,0,0,0,0,1,69,6,2,3,8,3,,1,1,69,6,2,3,8,3,,,4,2,1,2,1,2,60,0,,0,,4,100,240,2,2,2,2,2,,,2,2,,,,,,,,1,9,1,2,2,2,2,1,3,6,1,1,2,1,1,1,2,,2,1,86,168,3,1,1,3,7,7,8,3,8,7,1,1,1,1,2,,2,,," "," "," "," "," "," ",,,,,,,,,,,,,2,2,2,,,,1,,,,,,,,,,,,,3,3,1,2,2,2
42106723,42,2,18,1,3,1,1,1,1,1,1,1,1,1,1,1,,0,0,,1,0,0,0,0,0,2,47,4,4,3,8,2,,1,2,47,4,4,3,8,2,,,5,2,2,2,3,3,0,0,,3,180,3,360,300,1,1,1,2,,,,1,1,14,1,1,3,,1,99,1,5,2,2,2,1,1,,1,1,1,1,3,,,1,2,,1,1,67,165,1,2,1,8,8,6,2,2,8,8,3,1,1,1,1,2,2,,," "," "," "," "," "," ",,,,,,,,,,,,,2,2,2,,,,1,1,3,1,3,4,,,,,,,,4,4,2,2,2,2
66110704,66,3,79,1,3,1,1,1,1,1,1,1,1,1,1,1,,0,0,,1,0,0,0,0,0,2,67,6,3,4,8,2,,1,2,67,6,3,4,8,2,,,4,2,1,2,2,2,50,0,,0,,0,,90,2,2,2,2,1,1,2,2,1,45,1,1,10,,1,99,2,,,,,,1,,1,1,1,3,1,2,,2,2,,2,1,73,173,1,3,1,8,7,7,8,1,8,8,1,1,3,2,,,1,,1,"88","88","88","88","1","88",3,2,2,2,2,2,1,1,1,1,1,1,2,2,2,,,,3,2,,2,,,,,,,,,,4,3,2,2,2,2
10006511,10,3,3,1,4,1,2,2,2,1,2,,,,1,1,,0,0,,1,0,0,1,0,1,1,60,5,6,3,8,2,,1,1,60,5,6,3,8,2,,,5,1,1,1,1,1,10,0,,0,,3,90,180,2,2,2,2,2,,,2,1,25,1,1,10,,1,99,2,,,,,,1,,1,1,2,,3,,,2,2,,2,1,70,179,1,2,1,7,3,7,8,8,8,2,3,2,,2,,,2,,," "," "," "," "," "," ",,,,,,,,,,,,,2,2,2,,,,4,,,,,4,,,,,,,,3,1,2,2,2,2
66165045,66,3,189,1,1,1,2,2,2,1,1,2,3,2,3,3,,0,0,,8,0,0,1,0,1,1,19,2,6,3,8,1,3,5,1,18,2,6,8,8,2,,,1,1,1,1,1,1,100,3,540,0,,7,420,260,2,2,2,2,2,,,2,2,,,,,,,,1,2,2,2,2,1,2,1,3,6,1,1,3,,,1,2,,2,9,999,999,9,1,1,1,1,7,8,1,8,2,3,2,,2,,,2,,," "," "," "," "," "," ",,,,,,,,,,,,,2,2,2,,,,4,,,,,4,,,,,,,,3,1,2,2,2,2
46120176,46,3,117,1,2,2,1,2,1,1,1,1,1,1,3,5,,0,0,,4,0,0,0,0,0,1,44,4,2,3,8,1,1,2,2,42,4,2,3,8,1,4,1,3,1,1,2,2,1,70,0,,5,900,2,40,180,2,2,2,2,1,2,3,2,1,13,1,2,1,,2,,2,,,,,,1,,1,1,1,1,3,,,1,2,,2,1,66,163,1,3,1,7,2,8,1,2,8,2,4,2,,2,,,1,,2,"1","88","88","88","88","88",2,2,2,2,2,2,1,1,1,1,1,1,2,2,2,,,,4,1,2,1,3,2,2,2,1,2,2,2,2,4,4,2,2,2,2
2117762,2,1,783,3,3,1,1,1,1,1,1,1,1,1,1,1,,0,0,,1,0,0,0,0,0,1,56,5,5,7,6,1,3,1,1,56,5,5,7,6,1,3,1,3,2,1,1,1,2,80,0,,0,,2,30,720,1,2,2,1,,,,1,1,15,1,3,,5,,,2,,,,,,1,2,2,5,1,1,2,1,3,1,1,1,,1,108,168,3,3,1,2,2,7,2,5,2,7,3,1,2,1,2,,1,,30,"88","3","88","4,5","88","1",1,2,1,2,2,2,1,1,1,1,1,1,1,1,1,,2,,1,,,,,3,,,,,,,,4,1,1,2,2,2
14114238,14,2,1758,1,5,3,1,1,1,1,1,1,1,1,4,4,,0,0,,4,0,0,0,0,0,1,65,6,2,6,3,2,,3,2,30,3,6,6,1,1,3,3,2,1,1,1,1,1,90,0,,0,,7,840,480,1,2,2,2,,,,1,2,,,,,,,,1,9,1,2,1,1,2,1,3,6,1,1,3,,,1,2,,2,1,58,168,1,1,1,7,7,4,9,4,8,7,2,1,3,2,,,1,,2,"1","88","88","88","88","88",2,2,2,2,2,2,1,1,1,1,1,1,2,2,2,,,,3,2,,1,2,4,,,,,,,,4,1,2,2,2,2
14068032,14,2,674,3,1,1,1,1,1,1,1,1,1,1,1,1,,0,0,,1,0,0,0,0,0,1,25,3,6,6,8,1,2,1,1,25,3,6,6,8,1,2,9,3,1,1,1,1,1,70,3,60,1,80,0,,120,2,2,2,2,2,,,2,1,15,1,1,20,,2,,1,7,1,2,2,1,1,,1,1,2,,9,,,2,2,,1,1,79,185,1,3,1,8,8,8,9,3,8,8,4,2,,2,,,1,4,,"88","6","2","88","88","88",2,1,1,1,1,2,1,1,1,1,1,1,1,2,2,,,,9,,,,,3,,,,,,,,3,2,2,2,2,2
46082152,46,3,42,1,4,1,2,2,1,2,1,1,3,1,1,1,,0,0,,1,0,0,0,0,0,1,53,5,5,3,4,3,,1,1,53,5,5,3,4,3,,,5,1,1,1,2,1,50,0,,0,,7,420,180,1,1,2,2,,,,1,1,15,1,3,,4,,,2,,,,,,1,2,2,5,1,1,3,,,1,1,2,2,1,85,175,2,3,1,8,3,7,8,7,8,7,3,1,1,1,1,1,2,,," "," "," "," "," "," ",,,,,,,,,,,,,2,2,2,,,,1,,,,,3,,,,,,,,3,4,2,2,2,2
2026424,2,1,678,1,4,1,1,1,1,1,1,1,1,1,1,1,,0,0,,1,0,0,0,0,0,2,81,6,5,5,3,3,,1,2,81,6,5,5,3,3,,,4,2,1,1,2,1,70,0,,2,360,3,90,300,1,2,2,2,,,,1,2,,,,,,,,1,2,1,2,2,1,2,1,3,6,1,1,3,,,1,2,,2,1,68,164,2,2,1,8,7,7,2,4,2,7,1,1,1,2,,,1,7,,"88","1","88","88","88","88",3,2,2,2,2,2,1,1,1,1,1,1,2,2,2,,,,1,1,3,2,,,,,,,,,,4,1,2,2,2,2
2009937,2,1,486,3,2,1,1,1,1,1,1,1,1,1,1,1,,0,0,,1,0,0,0,0,0,2,46,4,6,7,2,2,,1,2,46,4,6,7,2,2,,,2,1,1,1,1,2,70,0,,0,,0,,360,2,2,1,2,,,,1,1,18,1,1,10,,1,1,1,7,1,2,2,1,1,,1,3,1,1,3,,,1,2,,2,1,56,165,1,1,1,8,8,4,4,2,8,7,4,1,2,2,,,1,3,,"88","2","88","88","88","88",1,2,2,2,2,2,1,1,1,1,1,1,2,2,2,,,,2,1,1,1,1,2,1,2,2,2,2,2,2,4,2,2,2,2,2
66172748,66,3,75,7,1,1,3,3,3,5,2,,,,1,1,,0,0,,1,1,0,1,0,2,1,62,5,3,2,8,3,,1,1,62,5,3,2,8,3,,,4,1,1,1,2,2,50,0,,0,,2,120,360,2,2,2,2,1,2,2,2,1,18,1,3,,5,,,2,,,,,,1,2,2,5,1,9,3,,,9,2,,2,3,64,162,1,1,1,8,8,3,1,3,8,8,4,2,,2,,,1,7,,"88","6","88","88","12","88",3,1,1,1,1,1,1,1,1,1,1,1,1,1,2,,,,4,,,,,4,,,,,,,,4,4,2,2,2,1
46003944,46,3,14,1,1,1,2,4,2,1,1,1,3,1,1,1,,0,0,,1,0,0,0,0,0,1,61,5,6,3,8,2,,1,1,61,5,6,3,8,2,,,1,1,1,1,2,1,80,0,,7,2100,7,420,180,1,1,2,2,,,,1,1,12,1,3,,5,,,2,,,,,,1,2,2,5,1,1,3,,,1,1,1,,1,70,160,2,3,5,7,4,7,3,3,2,7,3,1,1,2,,,2,,," "," "," "," "," "," ",,,,,,,,,,,,,2,2,2,,,,1,,,,,4,,,,,,,,4,4,2,2,2,2
22087320,22,4,186,1,2,1,2,2,1,1,1,2,2,1,1,4,,0,0,,6,0,0,1,0,1,2,42,4,3,5,8,1,4,1,2,42,4,3,5,8,1,4,1,3,1,1,1,1,1,80,0,,3,90,0,,180,2,2,2,2,2,,,2,2,,,,,,,,2,,,,,,2,2,3,6,1,2,3,,,2,2,,2,1,52,159,1,1,1,8,8,3,2,4,8,7,4,2,,2,,,2,,," "," "," "," "," "," ",,,,,,,,,,,,,2,2,2,,,,4,1,3,1,3,4,,,,,,,,4,4,2,1,2,2
66162575,66,3,80,4,1,1,2,4,2,1,1,1,1,2,1,1,,0,0,,1,1,0,0,0,1,1,56,5,6,2,8,3,,1,1,56,5,6,2,8,3,,,3,1,1,1,1,1,70,0,,0,,5,600,180,2,2,2,2,2,,,2,1,18,1,2,2,,1,99,1,7,2,2,2,1,1,,1,1,1,1,3,,,1,2,,2,1,65,165,1,3,1,8,2,2,8,7,8,3,4,2,,2,,,1,1,,"88","6","88","88","88","88",2,1,1,1,1,2,1,1,1,1,1,1,2,2,2,,,,1,,,,,4,,,,,,,,4,4,2,2,2,2
78062960,78,6,35,1,2,1,1,1,1,1,1,1,1,1,1,1,,0,0,,1,0,0,0,0,0,1,65,6,6,3,3,2,,1,1,65,6,6,3,3,2,,,4,2,2,2,1,1,50,0,,0,,7,130,120,2,2,2,2,1,1,3,2,2,,,,,,,,2,,,,,,2,2,3,6,1,3,3,,,2,1,1,,1,86,165,3,1,1,8,2,7,1,2,1,5,3,1,3,2,,,1,2,,"88","88","2","88","3","88",2,2,2,2,2,2,1,1,1,1,1,1,2,2,1,,1,3,1,,,,,1,1,2,2,2,2,2,2,4,1,2,2,2,2
82128849,82,2,155,3,2,1,1,1,1,1,1,1,1,1,1,1,,0,0,,1,0,0,0,0,0,2,25,3,6,6,2,3,,1,2,25,3,6,6,2,3,,,1,1,1,1,1,1,90,0,,0,,5,150,600,2,2,2,2,2,,,2,2,,,,,,,,2,,,,,,2,2,3,6,1,1,3,,,1,2,,2,1,42,165,1,3,1,8,7,3,7,7,8,8,2,1,2,2,,,2,,," "," "," "," "," "," ",,,,,,,,,,,,,2,2,2,,,,2,2,,1,1,3,,,,,,,,4,3,2,2,2,2
14080420,14,2,1577,1,2,1,3,3,1,1,2,,,,2,2,,0,0,,8,0,0,1,0,1,1,57,5,6,3,8,3,,1,1,57,5,6,3,8,3,,,4,2,1,1,3,2,40,0,,0,,5,150,240,2,2,2,1,,,,1,1,10,1,2,10,,9,,2,,,,,,1,,1,1,1,3,3,,,2,2,,2,1,62,160,1,3,1,8,2,1,3,3,8,1,4,2,,2,,,2,,," "," "," "," "," "," ",,,,,,,,,,,,,2,2,2,,,,4,,,,,4,,,,,,,,4,4,2,2,2,2
78058920,78,6,27,2,2,1,2,2,3,5,1,3,3,1,1,1,,0,0,,1,1,0,1,0,2,1,57,5,6,3,8,3,,1,1,57,5,6,3,8,3,,,5,1,1,1,3,3,50,0,,0,,3,90,360,1,2,2,2,,,,1,1,13,1,1,30,,1,99,1,7,1,2,2,1,1,,1,1,1,2,3,,,2,2,,2,3,67,165,1,1,1,8,8,8,8,2,1,8,4,2,,2,,,1,3,,"9","6","88","88","88","88",1,1,1,1,1,2,1,1,1,1,1,1,1,2,2,,,,4,,,,,4,,,,,,,,3,4,2,2,2,2
2079248,2,1,631,3,2,1,1,1,1,1,1,1,1,1,1,1,,0,0,,1,0,0,0,0,0,1,64,5,3,7,8,2,,1,1,64,5,3,7,8,2,,,4,2,1,2,2,1,60,0,,0,,7,70,240,1,2,2,2,,,,1,1,99,1,2,5,,1,99,2,,,,,,1,,1,1,1,1,3,,,1,2,,2,1,87,174,2,3,1,8,7,7,2,2,2,3,1,1,3,2,,,1,1,,"88","1","88","88","4","88",2,2,2,2,2,2,1,2,1,1,2,1,2,2,2,,,,3,,,,,3,,,,,,,,3,1,2,2,2,2
54165530,54,4,89,1,3,2,1,1,1,1,1,1,1,1,1,3,,0,0,,6,0,0,0,0,0,2,27,3,3,5,8,1,5,1,2,27,3,3,5,8,1,5,1,3,1,1,1,1,1,70,7,270,4,120,4,120,120,2,2,2,2,1,2,3,2,1,15,1,1,5,,2,,1,7,1,2,2,1,1,,1,1,1,1,2,2,,1,2,,1,1,65,170,1,1,1,8,8,7,7,7,8,7,3,2,,2,,,1,2,,"88","6","88","88","88","88",2,1,1,1,1,2,1,1,1,1,1,1,1,2,2,,,,4,2,,1,1,2,2,2,1,2,2,2,2,1,1,2,2,2,2
2079538,2,1,632,5,1,1,1,1,1,1,1,1,1,2,1,1,,0,0,,1,0,0,0,0,0,1,63,5,6,4,6,2,,1,1,63,5,6,4,6,2,,,3,1,1,1,1,1,90,0,,0,,7,80,300,2,2,2,2,2,,,2,1,16,1,3,,5,,,2,,,,,,1,2,2,5,1,1,3,,,1,2,,2,1,90,175,2,1,1,8,7,2,1,2,8,4,2,1,1,2,,,1,7,,"88","1","88","88","88","88",3,2,2,2,2,2,1,1,1,1,1,1,2,2,1,,1,3,1,,,,,2,1,2,2,2,2,2,2,4,1,2,2,2,2
94102015,94,6,58,1,3,2,1,1,1,1,1,1,1,1,2,4,,0,0,,4,0,0,0,0,0,1,42,4,2,7,3,2,,1,1,42,4,2,7,3,2,,,3,1,1,1,1,1,70,0,,0,,3,270,300,2,1,2,2,,,,1,1,18,1,1,10,,1,2,2,,,,,,1,,1,2,1,1,1,2,,1,2,,2,1,60,175,1,3,5,8,7,7,2,2,8,7,1,1,1,2,,,1,7,,"88","1","88","88","2","88",1,2,2,2,2,2,1,2,1,1,2,1,2,2,2,,,,1,,,,,2,1,2,2,2,2,2,2,1,2,2,2,2,2
42075458,42,2,32,1,2,1,2,2,2,1,1,1,1,1,1,1,,0,0,,1,0,0,0,0,0,1,58,5,6,2,8,3,,1,1,58,5,6,2,8,3,,,3,2,1,2,2,1,60,0,,0,,0,,600,1,2,2,2,,,,1,1,21,1,3,,5,,,2,,,,,,1,2,2,5,1,1,3,,,1,2,,2,2,55,153,1,1,1,8,3,4,8,7,8,7,4,1,1,2,,,1,7,,"88","4,5","88","88","88","88",1,2,2,2,2,2,1,1,1,1,1,1,1,2,1,,2,,1,,,,,3,,,,,,,,3,2,2,2,2,2
90088749,90,3,190,1,1,1,2,2,1,1,1,2,1,1,2,2,,0,0,,6,0,0,1,0,1,2,58,5,3,3,8,2,,1,2,58,5,3,3,8,2,,,5,2,1,2,2,3,20,0,,0,,0,,660,2,2,2,2,1,1,2,2,1,40,1,3,,5,,,2,,,,,,1,2,2,5,1,3,2,2,,2,1,1,,1,82,165,3,1,1,8,1,1,8,7,8,8,4,1,3,1,2,,2,,," "," "," "," "," "," ",,,,,,,,,,,,,2,2,2,,,,3,2,,2,,4,,,,,,,,4,3,2,2,2,2
82178867,82,2,1033,1,2,2,2,2,1,1,1,1,2,1,2,6,,0,0,,4,0,0,0,0,0,1,30,3,2,4,8,2,,2,2,26,3,2,4,8,3,,,3,1,1,1,1,1,75,0,,0,,0,,180,2,2,2,2,2,,,2,2,,,,,,,,2,,,,,,2,2,3,6,1,1,3,,,1,2,,2,1,66,175,1,1,1,8,8,5,1,3,8,1,3,1,9,2,,,2,,," "," "," "," "," "," ",,,,,,,,,,,,,2,2,2,,,,9,2,,2,,1,1,2,2,2,2,2,2,3,4,2,2,2,2
2024150,2,1,1487,3,1,1,1,1,1,1,1,1,1,1,2,2,,0,0,,2,0,0,0,0,0,1,64,5,2,6,6,3,,1,1,64,5,2,6,6,3,,,2,1,1,1,1,1,95,0,,0,,3,60,240,1,2,2,2,,,,1,2,,,,,,,,2,,,,,,2,2,3,6,1,1,1,2,,1,2,,1,1,79,166,2,2,1,8,7,2,4,1,8,7,2,1,1,2,,,2,,," "," "," "," "," "," ",,,,,,,,,,,,,2,2,2,,,,1,,,,,4,,,,,,,,4,1,2,2,2,2
82089950,82,2,379,1,2,1,1,2,1,1,1,1,1,1,1,1,,0,0,,1,0,0,0,0,0,1,44,4,6,5,8,2,,1,1,44,4,6,5,8,2,,,2,1,1,1,1,1,70,1,90,7,120,7,60,240,2,2,2,2,2,,,2,2,,,,,,,,2,,,,,,2,2,3,6,1,3,3,,,2,2,,1,1,90,176,2,3,1,8,7,2,2,3,1,7,2,2,,2,,,1,1,,"3","3","88","88","88","88",2,2,1,2,1,2,1,1,1,1,1,1,2,2,2,,,,3,,,,,3,,,,,,,,3,4,2,2,2,2
86118755,86,3,52,1,6,3,1,2,1,1,1,1,1,1,1,1,,0,0,,1,0,0,0,0,0,1,64,5,6,4,8,2,,1,1,64,5,6,4,8,2,,,4,1,1,1,2,3,55,0,,0,,4,720,300,1,2,2,2,,,,1,1,14,1,3,,5,,,1,7,2,2,2,1,1,1,2,5,1,1,2,1,1,1,1,2,2,1,90,175,2,1,1,8,8,5,6,8,8,8,3,9,,1,2,,2,,," "," "," "," "," "," ",,,,,,,,,,,,,2,2,2,,,,1,,,,,3,,,,,,,,4,4,2,2,2,2
14092745,14,2,3022,1,1,1,1,2,1,1,1,1,2,2,2,4,,0,0,,4,0,1,0,0,1,1,27,3,2,3,8,1,5,1,1,27,3,2,3,8,1,5,1,4,1,1,2,3,2,70,0,,0,,7,420,180,2,2,2,2,2,,,2,1,15,1,1,20,,1,99,1,7,1,2,2,2,1,,1,1,2,,3,,,2,2,,2,1,52,165,1,3,1,3,8,4,8,5,8,8,4,2,,2,,,2,,," "," "," "," "," "," ",,,,,,,,,,,,,2,2,2,,,,4,,,,,3,,,,,,,,4,4,2,2,2,2
14088141,14,2,553,3,3,1,1,1,1,1,1,1,1,1,1,1,,0,0,,1,0,0,0,0,0,2,57,5,6,5,8,2,,1,2,57,5,6,5,8,2,,,3,1,1,1,1,2,60,0,,7,1260,7,420,180,2,2,2,1,,,,1,1,22,1,1,10,,1,99,1,7,1,2,2,1,1,,1,1,1,1,3,,,1,2,,2,1,62,164,1,1,1,8,8,7,1,3,8,4,3,1,1,2,,,1,2,,"88","2","88","88","88","88",2,2,2,2,2,2,1,1,1,1,1,1,2,2,2,,,,1,1,3,1,3,3,,,,,,,,4,4,2,2,2,2
86114259,86,3,55,1,1,1,2,3,2,1,1,3,3,1,1,1,,0,0,,1,0,0,1,0,1,2,82,6,6,3,8,1,5,1,2,82,6,6,3,8,1,5,1,4,1,1,1,2,1,60,0,,0,,7,420,360,1,2,2,2,,,,1,2,,,,,,,,1,5,2,2,2,1,2,1,3,6,1,1,3,,,1,2,,2,3,68,167,1,1,4,8,2,4,8,3,8,8,4,1,3,2,,,1,1,,"88","1","88","88","88","88",2,2,2,2,2,2,1,1,1,1,1,1,2,2,2,,,,2,1,3,1,3,,,,,,,,,4,4,2,2,2,2
86051280,86,3,52,3,3,2,1,1,1,1,1,1,1,1,1,1,,0,0,,1,0,0,0,0,0,1,72,6,6,3,3,3,,1,1,72,6,6,3,3,3,,,3,1,1,1,1,1,80,0,,0,,7,60,240,1,2,2,2,,,,1,1,20,1,3,,5,,,2,,,,,,1,2,2,5,1,1,2,1,1,1,2,,2,1,63,185,1,1,1,3,7,7,7,2,8,7,1,1,3,2,,,1,2,,"88","1","88","88","88","88",3,2,2,2,2,2,1,1,1,1,1,1,2,2,2,,,,1,,,,,,,,,,,,,4,3,2,2,2,2
54138530,54,4,104,1,2,1,2,2,1,1,1,2,3,1,1,1,,0,0,,1,0,0,1,0,1,1,77,6,5,2,3,3,,1,1,77,6,5,2,3,3,,,3,1,1,1,1,1,60,0,,0,,3,30,120,2,2,2,2,2,,,2,2,,,,,,,,2,,,,,,2,2,3,6,1,1,2,2,,1,2,,2,3,75,177,1,1,1,8,2,7,8,7,8,4,3,2,,2,,,2,,," "," "," "," "," "," ",,,,,,,,,,,,,2,2,2,,,,4,,,,,,,,,,,,,4,4,2,2,2,2
78075125,78,6,48,2,3,2,1,1,1,1,1,3,2,1,2,2,,0,0,,6,1,0,1,0,2,2,75,6,5,2,6,1,4,1,2,75,6,5,2,6,1,4,3,3,1,1,1,2,1,70,0,,0,,5,50,900,2,2,2,2,1,2,3,2,2,,,,,,,,2,,,,,,2,2,3,6,1,1,2,2,,1,2,,2,3,999,154,9,1,1,8,7,7,7,7,8,2,1,1,1,1,2,,2,,," "," "," "," "," "," ",,,,,,,,,,,,,2,2,2,,,,1,2,,2,,,,,,,,,,4,3,2,2,2,2
18106807,18,4,341,1,3,2,1,2,1,1,1,1,1,2,5,8,,0,0,,4,0,0,0,0,0,1,44,4,2,5,8,2,,1,1,44,4,2,5,8,2,,,3,2,1,2,2,1,70,0,,1,240,1,30,480,1,2,2,2,,,,1,1,13,1,1,20,,2,,1,7,1,2,2,1,1,,1,1,1,1,3,,,1,2,,2,1,81,175,2,1,1,8,8,8,8,8,8,8,4,2,,2,,,2,,," "," "," "," "," "," ",,,,,,,,,,,,,2,2,2,,,,4,,,,,3,,,,,,,,4,3,2,2,2,2
58033776,58,6,22,4,1,1,2,2,2,1,1,2,1,2,1,1,,0,0,,1,1,0,1,0,2,2,62,5,5,1,8,3,,1,2,62,5,5,1,8,3,,,3,1,1,1,2,2,50,0,,0,,7,420,300,2,2,2,2,1,1,2,2,2,,,,,,,,2,,,,,,2,2,3,6,1,1,2,2,,1,1,1,,1,65,150,2,1,1,8,1,2,1,2,8,8,4,2,,2,,,2,,," "," "," "," "," "," ",,,,,,,,,,,,,2,2,2,,,,4,2,,2,,4,,,,,,,,4,4,2,2,2,1
58166915,58,6,69,1,3,2,1,1,1,1,1,1,2,1,2,2,,0,0,,8,0,0,0,0,0,1,49,4,4,5,8,1,3,1,1,49,4,4,5,8,1,3,2,3,1,1,1,2,2,35,7,840,7,840,7,840,60,2,2,2,2,1,2,2,2,1,22,2,3,,5,,,2,,,,,,1,2,3,6,1,2,3,,,2,2,,1,1,68,168,1,1,5,8,2,7,8,1,8,2,3,1,3,1,2,,2,,," "," "," "," "," "," ",,,,,,,,,,,,,2,2,2,,,,9,,,,,2,1,2,2,2,2,2,2,3,1,2,2,2,2
78061468,78,6,14,3,1,1,1,1,1,1,1,1,1,1,1,1,,0,0,,1,0,0,0,0,0,2,27,3,6,6,8,2,,1,2,27,3,6,6,8,2,,,4,1,1,1,2,1,80,0,,3,180,7,840,30,1,1,2,2,,,,1,1,14,1,1,3,,1,3,2,,,,,,1,,1,2,1,3,1,2,,2,2,,2,1,56,167,1,2,1,2,2,8,2,3,8,7,4,1,1,2,,,1,,4,"1","1","2","3",",5","88",3,2,2,2,2,2,2,2,1,2,2,1,2,2,2,,,,1,2,,1,1,2,2,2,1,2,2,2,2,4,1,2,2,2,2
66169010,66,3,418,3,2,1,2,2,2,1,1,1,1,2,2,7,,0,0,,7,0,1,0,0,1,2,19,2,6,4,8,3,,1,2,19,2,6,4,8,3,,,3,1,1,2,2,3,50,0,,0,,1,30,180,2,2,2,2,1,1,1,2,1,13,1,2,1,,1,1,1,7,1,2,2,2,1,,1,3,2,,3,,,2,2,,2,2,45,152,1,2,1,8,3,7,8,8,8,3,3,2,,2,,,1,,1,"1","88","88","88","88","88",2,2,2,2,2,2,1,1,1,1,1,1,2,2,2,,,,2,2,,2,,2,1,2,2,2,2,2,2,3,4,2,1,1,2
90099950,90,3,272,1,2,1,2,2,1,1,1,1,3,1,2,2,,0,0,,2,0,0,0,0,0,1,58,5,1,3,8,3,,1,1,58,5,1,3,8,3,,,5,2,1,2,2,2,30,0,,2,240,2,60,120,1,2,2,2,,,,1,1,25,1,2,5,,1,99,1,1,2,2,2,1,1,,1,1,1,2,1,2,,2,2,,1,1,69,171,1,2,1,8,1,8,8,7,8,7,4,2,,2,,,1,,1,"88","6","88","88","88","88",2,1,1,1,1,2,1,1,1,1,1,1,2,2,2,,,,4,,,,,2,2,1,2,2,2,2,2,3,4,2,2,2,2
86089014,86,3,44,1,3,2,1,1,1,1,1,1,1,1,1,1,,0,0,,1,0,0,0,0,0,2,65,6,6,3,3,3,,1,2,65,6,6,3,3,3,,,4,2,1,1,2,1,70,0,,0,,0,,300,1,2,2,2,,,,1,2,,,,,,,,2,,,,,,2,2,3,6,1,1,1,2,,1,2,,2,1,999,999,9,2,1,8,8,9,1,9,8,9,4,2,,2,,,2,,," "," "," "," "," "," ",,,,,,,,,,,,,2,2,2,,,,9,2,,2,,4,,,,,,,,3,3,2,2,2,2
54130737,54,4,254,1,4,3,1,2,1,1,1,1,2,1,5,6,,0,0,,4,0,0,0,0,0,1,46,4,2,5,8,1,2,3,2,19,2,6,6,8,3,,,1,1,1,1,2,1,90,2,180,0,,7,105,300,2,1,2,2,,,,1,1,14,2,3,,5,,,1,7,1,2,1,1,1,1,3,6,1,1,3,,,1,2,,2,1,48,165,1,1,1,8,2,7,5,7,8,7,3,2,,2,,,2,,," "," "," "," "," "," ",,,,,,,,,,,,,2,2,2,,,,4,2,,2,,2,1,1,2,2,2,2,2,4,1,1,2,2,2
18084878,18,4,214,1,3,3,1,2,1,1,1,1,1,1,3,3,,0,0,,4,0,0,0,0,0,1,65,6,2,4,8,2,,2,2,58,5,2,3,8,1,2,1,4,1,1,1,2,2,50,0,,0,,7,30,240,2,2,2,2,2,,,2,2,,,,,,,,2,,,,,,2,2,3,6,1,1,3,,,1,2,,2,9,56,170,1,1,1,8,3,5,3,7,8,3,3,1,1,1,2,,2,,," "," "," "," "," "," ",,,,,,,,,,,,,2,2,2,,,,1,1,3,1,3,4,,,,,,,,4,1,1,2,2,2
58167365,58,6,127,3,2,1,2,1,1,1,1,1,1,1,2,3,,0,0,,4,0,0,0,0,0,1,64,5,2,3,8,2,,1,1,64,5,2,3,8,2,,,4,2,1,1,3,1,80,0,,0,,0,,360,2,2,2,2,2,,,2,2,,,,,,,,2,,,,,,2,2,3,6,1,2,3,,,2,2,,2,1,83,170,2,1,1,8,2,7,1,4,8,8,3,1,2,2,,,2,,," "," "," "," "," "," ",,,,,,,,,,,,,2,2,2,,,,3,,,,,3,,,,,,,,4,1,2,2,2,2
82117901,82,2,1966,1,1,1,1,2,1,1,1,1,3,1,1,4,,0,0,,6,0,1,0,0,1,2,21,2,3,4,8,3,,1,2,21,2,3,4,8,3,,,2,1,1,1,1,1,70,0,,0,,7,420,120,2,2,2,2,1,2,1,2,2,,,,,,,,1,7,1,2,2,2,2,1,3,6,1,1,2,2,,1,2,,2,1,57,999,9,1,1,1,6,8,2,7,2,7,2,2,,2,,,1,1,,"1","88","88","1,5","88","88",3,2,2,2,2,2,2,1,1,2,1,1,2,2,2,,,,9,1,9,1,1,1,2,2,2,1,2,2,2,3,3,2,2,2,2
46081875,46,3,43,1,2,1,2,3,2,2,1,3,3,1,1,1,,0,0,,1,0,0,1,0,1,1,51,5,6,3,8,3,,1,1,51,5,6,3,8,3,,,1,1,1,1,1,1,90,0,,0,,7,60,120,2,2,2,2,2,,,2,1,15,1,1,10,,2,,1,7,1,2,2,2,1,,1,1,1,1,3,,,1,2,,2,1,80,172,2,2,1,8,8,5,3,7,8,8,3,2,,2,,,1,3,,"9","60","88","15","88","88",2,1,1,1,1,1,1,1,1,1,1,1,1,1,2,,,,4,,,,,1,1,2,2,2,2,2,2,4,4,2,2,2,2
86126208,86,3,49,1,9,4,1,1,1,1,1,1,1,1,1,1,,0,0,,1,0,0,0,0,0,2,70,6,6,2,5,3,,1,2,70,6,6,2,5,3,,,4,1,1,1,2,1,70,0,,0,,1,20,120,2,2,2,2,1,2,3,2,2,,,,,,,,2,,,,,,2,2,3,6,1,1,1,1,1,1,2,,2,1,70,158,2,1,1,8,1,7,1,3,8,7,3,1,3,1,2,,1,1,,"88","1","88","88","88","88",2,2,2,2,2,2,1,1,1,1,1,1,2,2,1,2,2,,3,2,,1,3,,,,,,,,,4,4,2,2,2,2
14022523,14,2,340,3,1,1,1,2,1,1,1,1,1,1,1,1,,0,0,,1,0,0,0,0,0,2,21,2,6,6,8,3,,1,2,21,2,6,6,8,3,,,2,1,1,1,1,1,90,0,,2,30,0,,600,2,2,2,2,2,,,2,2,,,,,,,,2,,,,,,2,2,3,6,1,2,3,,,2,2,,2,1,52,163,1,3,1,8,7,7,2,7,2,7,1,2,,9,,,1,1,,"88","88","1","88","88","88",2,2,2,2,2,2,1,1,1,1,1,1,2,2,2,,,,4,2,,1,1,2,2,2,1,2,2,2,2,3,1,2,2,2,2
14022624,14,2,340,3,1,1,1,2,1,1,1,1,1,1,1,1,,0,0,,1,0,0,0,0,0,2,19,2,6,6,1,3,,1,2,19,2,6,6,1,3,,,2,1,1,1,1,2,80,0,,0,,4,240,600,1,2,2,2,,,,1,1,14,1,2,1,,1,99,1,7,2,2,1,1,1,,1,1,1,2,3,,,2,1,1,,1,69,164,2,3,1,8,6,6,1,2,1,7,1,1,3,2,,,1,2,,"2","88","88","88","88","88",2,2,2,2,2,2,1,1,1,1,1,1,2,2,2,,,,1,2,,1,1,4,,,,,,,,2,2,2,2,2,2
22062670,22,4,121,1,4,2,1,2,1,4,1,1,2,1,1,2,,0,0,,6,0,0,0,0,0,2,39,4,6,6,8,3,,1,2,39,4,6,6,8,3,,,3,1,1,1,1,1,50,0,,0,,7,420,120,1,1,2,2,,,,1,2,,,,,,,,2,,,,,,2,2,3,6,1,1,3,,,1,2,,2,1,52,168,1,1,1,8,3,5,3,7,8,7,3,2,,2,,,2,,," "," "," "," "," "," ",,,,,,,,,,,,,2,2,2,,,,3,1,1,1,1,2,2,2,1,2,2,2,2,4,4,2,2,2,2
86159608,86,3,68,1,3,1,1,1,1,1,1,1,1,1,2,2,,0,0,,2,0,0,0,0,0,1,39,4,2,6,5,1,2,1,1,39,4,2,6,5,1,2,3,3,1,1,1,1,2,65,0,,0,,3,180,300,2,2,2,2,1,2,5,2,1,18,1,1,5,,1,99,1,5,2,2,2,1,1,,1,1,1,1,3,,,1,1,2,2,1,122,186,3,1,4,8,8,4,2,3,8,4,4,1,2,2,,,2,,," "," "," "," "," "," ",,,,,,,,,,,,,2,2,2,,,,2,,,,,2,1,1,2,2,2,2,2,4,3,2,2,2,2
86139427,86,3,38,1,2,1,2,3,2,1,1,3,3,1,1,1,,0,0,,1,0,0,1,0,1,1,45,4,4,4,8,2,,1,1,45,4,4,4,8,2,,,3,1,1,1,1,2,70,0,,1,180,0,,240,2,2,2,2,1,2,3,2,1,15,1,1,5,,1,3,1,3,2,2,2,1,1,,1,2,2,,3,,,2,2,,2,3,95,182,2,3,1,8,8,4,2,7,8,2,4,2,,2,,,1,,2,"6","18","88","88","88","88",1,1,1,1,1,2,1,1,1,1,1,1,2,2,2,,,,4,,,,,3,,,,,,,,3,4,2,2,2,2
86139543,86,3,54,1,2,1,2,3,2,1,2,,,,1,1,,0,0,,1,0,0,1,0,1,1,55,5,3,3,8,1,2,1,1,55,5,3,3,8,1,2,1,4,2,1,2,3,2,0,0,,1,180,1,60,180,1,2,2,2,,,,1,1,14,1,3,,5,,,1,2,2,2,2,1,1,1,2,5,1,2,2,2,,2,2,,2,2,78,170,2,2,1,8,8,3,3,8,1,2,4,2,,2,,,1,,2,"88","6","88","88","18","88",1,1,1,1,1,1,1,1,1,1,1,1,2,1,2,,,,9,,,,,1,1,2,2,2,2,2,2,3,3,2,2,2,1
70088841,70,5,64,1,3,1,2,2,1,1,1,1,2,1,1,1,,0,0,,1,0,0,0,0,0,2,54,5,5,3,8,2,,1,2,54,5,5,3,8,2,,,5,2,1,2,3,3,30,0,,7,1680,0,,300,1,2,2,2,,,,1,1,15,1,1,20,,9,,2,,,,,,1,,1,1,1,1,3,,,1,1,2,2,1,100,158,3,1,1,2,8,2,3,7,8,8,4,1,1,2,,,2,,," "," "," "," "," "," ",,,,,,,,,,,,,2,2,2,,,,3,2,,1,3,4,,,,,,,,4,4,2,2,2,2
86124125,86,3,71,1,3,2,1,1,1,1,1,1,3,1,2,2,,0,0,,8,0,0,0,0,0,2,28,3,6,6,8,3,,1,2,28,3,6,6,8,3,,,2,1,1,1,1,1,80,3,360,0,,6,360,660,2,2,2,2,2,,,2,2,,,,,,,,1,5,2,2,1,1,2,1,3,6,1,1,3,,,1,2,,2,1,58,178,1,1,1,8,4,4,2,4,1,7,4,1,1,2,,,2,,," "," "," "," "," "," ",,,,,,,,,,,,,2,2,2,,,,1,2,,2,,2,2,2,1,2,2,2,2,3,3,2,2,2,2
82045860,82,2,723,1,2,1,1,2,1,1,1,1,1,1,2,2,,0,0,,2,0,0,0,0,0,1,42,4,1,5,8,2,,1,1,42,4,1,5,8,2,,,1,1,1,1,1,1,80,0,,0,,7,240,30,2,2,2,2,2,,,2,1,23,1,1,30,,2,,1,7,1,2,2,2,1,,1,1,1,1,3,,,1,2,,2,2,70,171,1,3,1,8,2,2,7,7,8,8,4,1,3,2,,,1,7,,"88","2","88","88","88","88",2,2,2,2,2,2,1,1,1,1,1,1,2,2,2,,,,3,,,,,2,2,2,2,2,2,2,1,3,4,2,2,2,2
54151661,54,4,239,1,1,1,2,2,2,1,1,2,3,2,2,2,,0,0,,2,0,0,1,0,1,1,28,3,1,4,8,2,,2,2,18,2,1,4,8,3,,,3,1,1,1,1,1,80,0,,7,840,0,,300,2,2,2,2,2,,,2,2,,,,,,,,2,,,,,,2,2,3,6,2,,3,,,2,1,2,2,1,70,160,2,3,1,8,7,7,1,7,8,2,1,2,,2,,,2,,," "," "," "," "," "," ",,,,,,,,,,,,,2,2,2,,,,3,2,,1,1,1,1,1,2,2,2,2,2,3,4,2,2,2,2
86157242,86,3,46,1,5,3,1,1,1,1,1,1,1,2,1,1,,0,0,,1,0,0,0,0,0,2,64,5,6,4,5,2,,1,2,64,5,6,4,5,2,,,4,1,1,1,2,1,60,0,,0,,1,120,360,1,2,2,2,,,,1,1,17,1,3,,5,,,2,,,,,,1,2,2,5,1,1,3,,,1,2,,2,1,55,156,1,1,1,4,7,7,7,7,1,7,1,1,1,2,,,2,,," "," "," "," "," "," ",,,,,,,,,,,,,2,2,2,,,,2,2,,1,3,4,,,,,,,,4,4,2,2,2,2
70089019,70,5,130,1,4,3,2,2,2,1,1,2,3,1,2,3,,0,0,,6,0,0,1,0,1,2,41,4,6,3,8,3,,1,2,41,4,6,3,8,3,,,4,1,1,1,1,3,60,0,,7,840,0,,180,2,2,2,2,2,,,2,1,22,1,3,,5,,,2,,,,,,1,2,2,5,1,1,3,,,1,2,,2,1,57,163,1,1,1,8,1,7,2,1,8,8,3,2,,2,,,1,,2,",5","88","88","88","88","88",2,2,2,2,2,2,1,1,1,1,1,1,2,2,2,,,,4,2,,2,,2,2,2,2,1,2,2,2,4,1,1,2,2,2
82001543,82,2,261,2,1,1,2,2,1,1,1,3,3,2,1,1,,0,0,,1,1,0,1,0,2,2,58,5,3,3,8,3,,1,2,58,5,3,3,8,3,,,4,2,1,1,1,1,80,0,,0,,0,,540,2,2,2,2,2,,,2,2,,,,,,,,2,,,,,,2,2,3,6,1,1,3,,,1,2,,2,1,60,162,1,1,1,8,8,8,8,8,8,8,4,2,,2,,,2,,," "," "," "," "," "," ",,,,,,,,,,,,,2,2,1,2,1,1,1,2,,9,,4,,,,,,,,4,4,2,2,2,2
90157143,90,3,690,1,2,2,2,2,2,1,1,2,3,1,4,9,,0,0,,4,0,1,1,0,2,1,35,4,1,4,8,1,3,2,2,40,4,1,3,8,3,,,3,1,1,1,2,1,80,0,,7,2100,7,105,180,1,2,2,2,,,,1,2,,,,,,,,1,7,1,2,2,2,2,1,3,6,1,1,3,,,1,2,,2,1,53,165,1,1,1,8,2,7,3,4,8,5,3,9,,2,,,2,,," "," "," "," "," "," ",,,,,,,,,,,,,2,2,2,,,,1,2,,1,3,3,,,,,,,,4,4,2,2,2,2
74007227,74,5,59,1,2,1,1,2,1,1,1,2,1,2,1,3,,0,0,,6,0,0,1,0,1,2,42,4,3,3,8,3,,1,2,42,4,3,3,8,3,,,2,1,1,1,1,1,80,0,,0,,6,720,120,2,2,2,2,2,,,2,1,18,2,3,,5,,,2,,,,,,1,2,3,6,2,,3,,,2,2,,1,1,88,999,9,2,1,8,8,2,2,7,2,3,4,2,,2,,,2,,," "," "," "," "," "," ",,,,,,,,,,,,,2,2,2,,,,3,2,,2,,4,,,,,,,,4,3,2,2,2,2
22039247,22,4,105,1,3,1,1,2,1,1,1,1,2,1,1,1,,0,0,,1,0,0,0,0,0,2,66,6,5,3,5,3,,1,2,66,6,5,3,5,3,,,4,2,2,2,2,2,40,0,,0,,3,90,180,1,2,2,1,,,,1,2,,,,,,,,2,,,,,,2,2,3,6,1,1,1,1,3,1,2,,2,2,54,150,1,1,5,8,3,7,8,3,8,7,3,1,1,2,,,2,,," "," "," "," "," "," ",,,,,,,,,,,,,2,2,1,2,1,1,1,2,,1,3,,,,,,,,,4,1,2,2,2,2
30167639,30,2,73,1,2,1,2,2,2,1,1,1,1,1,1,2,,0,0,,6,0,0,0,0,0,1,24,2,6,3,8,1,5,1,1,24,2,6,3,8,1,5,9,1,1,1,1,2,1,85,0,,1,180,3,135,180,2,2,2,2,2,,,2,1,12,1,1,10,,2,,1,7,2,2,2,1,1,,1,1,1,2,3,,,2,2,,2,1,65,175,1,2,1,8,8,8,1,4,8,8,4,2,,2,,,2,,," "," "," "," "," "," ",,,,,,,,,,,,,2,2,2,,,,4,,,,,1,2,2,1,2,2,2,2,3,3,2,2,2,2
82081841,82,2,469,3,3,1,1,1,1,1,1,1,1,1,1,1,,0,0,,1,0,0,0,0,0,2,62,5,4,5,1,3,,1,2,62,5,4,5,1,3,,,3,1,1,1,1,1,100,0,,0,,7,130,180,2,2,2,2,2,,,2,1,16,1,1,20,,1,99,2,,,,,,1,,1,1,1,2,3,,,2,2,,1,2,62,170,1,2,1,8,7,7,7,4,1,7,1,1,1,1,2,,2,,," "," "," "," "," "," ",,,,,,,,,,,,,2,2,2,,,,1,1,3,2,,4,,,,,,,,4,1,2,2,2,2
30130159,30,2,139,1,3,2,1,2,1,1,1,1,1,1,1,3,,0,0,,6,0,0,0,0,0,1,57,5,4,7,3,2,,1,1,57,5,4,7,3,2,,,4,1,1,1,1,1,60,7,600,4,360,7,240,240,2,2,2,2,2,,,2,1,14,1,3,,5,,,1,7,1,2,2,1,1,1,2,5,1,3,3,,,2,1,1,,1,91,173,3,1,1,8,1,4,8,3,8,1,4,2,,2,,,1,1,,"88","2","88","88","88","88",2,2,2,2,2,2,1,1,1,1,1,1,2,2,2,,,,3,,,,,2,1,2,2,2,2,2,2,4,1,2,2,2,2